program: Gaussian 09
title: 000140864
version: EM64L-G09RevD.01
frameworkgroup: C1[X(C6H16N2)]
method: RPBEPBE
basis: SDD
operation: Freq
keyword: #pfreq=noraman
keyword: PBEPBE/SDD
title: #p freq=noraman PBEPBE/SDD
converged: YES YES NO NO
title: Mulliken charges:
elementType: N N C C C C C C H H H H H H H H H H H H H H H H
charge: -0.087356 -0.086656 -0.306191 -0.294974 -0.684245 -0.676368 -0.616027 -0.591920 0.185155 0.205674 0.173631 0.199962 0.229618 0.210004 0.205916 0.214550 0.243106 0.194179 0.227219 0.193480 0.224423 0.211254 0.178851 0.246715
chargesum: 0.00000
title: Mulliken charges with hydrogens summed into heavy atoms:
elementType: N N C C C C C C
charge: -0.087356 -0.086656 0.084638 0.078619 -0.038707 -0.024533 0.029095 0.044900
polarizability: 8.90518950e+01 -7.08622120e-01 8.32875344e+01 8.49532598e-02 -1.91653516e-01 7.34863827e+01
1716.lowfreq: -13.0366 -2.4719 -0.0005 -0.0005 -0.0002 7.9421 69.8342 77.7305 115.5876
frequency: 69.7588 77.4172 115.5528 174.0894 187.8837 210.2780 218.9231 231.9356 272.1124 282.8034 327.8554 373.8494 446.1013 487.1260 506.8067 664.0275 786.4751 799.6043 847.5073 933.6518 961.0258 1005.6556 1037.5726 1064.5141 1081.3502 1088.0033 1104.5218 1134.4355 1162.2113 1190.1714 1204.4369 1237.3784 1275.5563 1285.2461 1348.6075 1361.2456 1376.2733 1386.4197 1404.6548 1422.4382 1451.5546 1457.4695 1462.0060 1464.9236 1470.3043 1475.2113 1478.9451 1487.3518 1488.2631 1494.0922 2858.9284 2860.7853 2871.1611 2887.8554 2983.3182 2984.7043 3018.9784 3020.2215 3022.8861 3032.4895 3075.5521 3076.4189 3080.3496 3092.0172 3100.1147 3103.2710
redmass: 2.1329 2.2535 2.0661 1.9510 1.2957 1.2170 1.3085 1.0618 1.7723 1.7430 2.7562 2.3957 2.8041 2.8239 3.3168 3.4374 1.3002 1.1436 2.3746 1.8849 2.3313 1.5631 2.6727 2.0169 1.3567 1.7840 1.8316 1.4878 2.0145 2.4340 2.5253 2.6778 1.1450 1.2679 1.3060 1.3978 1.2495 1.2166 1.1374 1.1508 1.0603 1.0434 1.0598 1.0523 1.0674 1.0708 1.0479 1.0519 1.0541 1.0612 1.0574 1.0711 1.0671 1.0561 1.0357 1.0358 1.0756 1.0833 1.0806 1.0860 1.0983 1.1006 1.0990 1.1005 1.1001 1.0983
irintensity: 0.0797 0.2420 0.4184 2.5781 0.4761 0.8296 0.4609 0.2509 1.2082 1.7019 0.7355 10.6719 9.3313 2.2784 11.7897 6.6885 11.6497 3.7403 3.7186 1.7297 19.0739 10.7400 8.8941 9.5589 5.7286 0.8102 14.5911 1.8430 1.1268 20.1654 6.9922 7.0105 9.7228 5.3579 4.0530 2.5199 26.2626 16.8224 8.9311 5.9156 8.3087 9.5370 4.4544 7.5349 13.3875 4.2708 7.8381 7.1397 8.4219 15.0309 114.6077 21.3488 87.1717 190.1906 38.4948 38.4155 23.0565 30.1591 50.5042 28.9442 49.5091 30.1041 42.0141 42.3532 33.8803 24.3467
temp: 298.150 k
press: 1.00000 atm
elementType: 7 7 6 6 6 6 6 6 1 1 1 1 1 1 1 1 1 1 1 1 1 1 1 1
symmnumber: 1
zpe: 567895.1 jmol-1
zpe.correction: 0.216300 hartree
zpe.thermalcorrener: 0.227358 hartree
zpe.thermalcorrenthalpy: 0.228303 hartree
zpe.thermalcorrgfe: 0.180545 hartree
zpe.sumelectzpe: -346.980458 hartree
zpe.sumelectthermal: -346.969400 hartree
zpe.sumelectthermalent: -346.968455 hartree
zpe.sumelectthermalfe: -347.016213 hartree
dipole: -0.0747 -1.0694 -0.9266
dipole: 1.4170
quadrupole: -50.9731 -52.2866 -52.1903
quadrupole: -1.4870 0.3926 -0.7065
quadrupole: 0.8435 -0.4699 -0.3736 -1.4870 0.3926 -0.7065
hfenergy: -347.196758 hartree
pointgroup: C01 [X(C6H16N2)]
dipole: -0.0241314 0.3781745 0.4088787 debye
dipolederiv: -0.1074228 -0.0243049 0.0005492 0.1926651 -0.3334851 0.0404153 0.1072426 0.0614744 -0.5278614 -0.0618132 0.0514803 0.0899373 -0.022712 -0.6313042 -0.017597 -0.0593627 -0.0176038 -0.2418385 0.1574905 -0.209351 -0.0792137 -0.1892217 0.251601 0.0376888 -0.0696357 0.0243534 0.393783 0.1305504 0.1171495 0.0558324 0.0911793 0.4718606 -0.091438 0.0826265 -0.068842 0.3641895 -0.0818262 0.0517952 -0.0466996 0.0761049 0.0650791 0.0212494 -0.0300818 -0.008687 0.0248422 0.0237987 0.0298838 0.0044843 0.0400288 -0.0681696 -0.0822567 0.0283592 -0.0711693 0.018801 0.0038482 -0.0614419 0.0654039 -0.0658097 0.3284521 0.1009536 0.0670312 0.132469 0.221914 0.1680793 0.0228336 -0.1222869 0.0120765 0.4240586 -0.0935568 -0.1624146 -0.1254981 0.2036615 -0.0211865 0.0705388 0.0166307 0.0546668 0.0083784 0.0539833 0.0732571 -0.0699975 -0.2718549 -0.0211204 -0.1120671 -0.0011832 -0.0823248 -0.1136992 0.000406 0.018789 0.0185605 0.0607462 0.0543211 0.0251037 -0.078962 -0.0181092 -0.0767087 0.0050828 -0.0183161 0.1148777 -0.2692674 -0.1917923 -0.0033515 0.0154457 0.0122935 0.0478115 -0.0129025 -0.0090308 -0.0074693 0.0616037 0.0816484 -0.0155808 0.0509577 -0.0132042 0.0983772 0.0089024 -0.0210634 0.0473982 -0.1474635 -0.0064466 -0.108102 0.002802 -0.1654113 -0.0617133 0.0272862 0.0159268 0.0489859 0.0719172 -0.017126 0.1083445 0.0184474 0.1546215 -0.1107086 -0.0699268 0.0355482 -0.0873821 0.0637926 0.0623204 0.0082164 -0.0734469 0.0279914 0.0877351 0.0509056 -0.0713116 -0.0241387 -0.1474323 -0.120668 0.0631337 0.0207971 0.007294 0.1490753 0.013827 -0.0030672 -0.0012577 0.0816827 0.064212 -0.0972063 0.032446 -0.0753704 -0.1863131 0.0475963 0.043178 0.0895422 0.0551156 0.0801088 -0.0680097 0.1223463 -0.0556322 -0.0026802 0.0968153 0.0627118 0.0790989 -0.0483483 0.0586972 0.0633238 -0.0012702 -0.0059663 -0.235829 -0.1808669 -0.0493589 -0.0506133 -0.0497555 -0.1966838 0.0257707 -0.0649928 0.0382812 0.0784711 -0.0240568 -0.0238516 -0.0217539 0.0833361 -0.2183944 -0.0031574 0.0393061 0.030458 0.0616856 0.0350318 -0.0312646 0.0159019 0.0951501 0.0438181 0.0753227 0.032158 -0.0263042 -0.3129106 0.092363 0.0516571 -0.0389949 0.0074548 0.1155871 -0.0103239 -0.0994886 -0.0175947 0.060936 -0.0599053 -0.0375687 -0.0392545 -0.1041686 unknown
polarizability: 89.0564153|0.1586754|83.1283337|1.0692541|0.9181257|73.6410631 unknown
InChI: InChI=1S/C6H16N2/c1-5-8(6-2)7(3)4/h5-6H2,1-4H3
charge 0 multiplicity 1
24 atoms
N  -0.2650 -0.011339 -0.095355
N  1.180846 0.051052 0.081675
C  -1.019347 1.152471 0.469379
C  -0.785177 -1.335924 0.333597
C  -2.374343 1.361884 -0.233654
C  -0.275631 -2.471925 -0.567012
C  1.65441 0.380468 1.44924
C  1.814958 0.86343 -0.970618
H  -1.178294 1.058194 1.572164
H  -0.398321 2.054314 0.309286
H  -0.528152 -1.554753 1.400685
H  -1.888323 -1.282467 0.280237
H  -2.225032 1.465095 -1.322602
H  -3.064817 0.516351 -0.063205
H  -2.867967 2.276291 0.145814
H  -0.627002 -2.328239 -1.604079
H  0.827502 -2.47507 -0.571745
H  -0.634961 -3.453049 -0.2032
H  1.15681 -0.276061 2.184741
H  1.482366 1.442228 1.751511
H  2.740841 0.185363 1.5039
H  2.910552 0.717221 -0.926531
H  1.614523 1.961123 -0.883901
H  1.444959 0.520243 -1.949429
