program: Gaussian 09
title: 000140862
version: EM64L-G09RevD.01
frameworkgroup: C1[X(C10H6)]
method: RPBEPBE
basis: SDD
operation: Freq
keyword: #p
keyword: freq=noraman
keyword: PBEPBE/SDD
title: #p freq=noraman PBEPBE/SDD
converged: YES YES NO YES
title: Mulliken charges:
elementType: C C C C C C C C C C H H H H H H
charge: 0.155069 0.155075 -0.378849 -0.378844 -0.221360 -0.221361 0.149955 0.149956 -0.474302 -0.474306 0.253454 0.253453 0.235179 0.235178 0.280852 0.280852
chargesum: 0.00000
title: Mulliken charges with hydrogens summed into heavy atoms:
elementType: C C C C C C C C C C
charge: 0.155069 0.155075 -0.125395 -0.125391 0.013819 0.013817 0.149955 0.149956 -0.193449 -0.193455
polarizability: 1.61305761e+02 2.88442071e-04 1.21929076e+02 9.15315711e-03 -2.47204944e-03 3.99454989e+01
1716.lowfreq: -10.8489 -7.0372 -0.0006 0.0003 0.0005 6.6041 106.8694 112.1489 166.3932
frequency: 106.8694 112.1478 166.3931 168.7190 345.7063 378.3535 411.4844 436.8826 523.6913 547.3487 568.2536 577.9118 620.4291 623.8469 645.8159 651.2605 700.3818 756.3770 775.9112 804.7946 892.4454 966.7511 995.8772 1036.0642 1089.8726 1175.9001 1191.6827 1215.7335 1273.3069 1354.5817 1425.8390 1470.1034 1559.4549 1598.4399 2129.4665 2135.1645 3136.3222 3149.0909 3162.5164 3174.1067 3428.9043 3429.4298
redmass: 4.3518 3.8662 4.2553 4.1067 4.8623 3.6028 7.5902 8.2764 4.0744 7.2376 4.0407 6.7520 1.2546 1.2431 1.2263 1.2490 5.4536 4.0848 1.2627 6.0120 1.4175 1.3895 1.3413 2.3684 2.5597 1.0614 2.3377 2.9047 1.5014 11.3455 2.1965 2.6064 6.4042 6.0592 6.2602 6.2567 1.0855 1.0900 1.0953 1.1010 1.1562 1.1560
irintensity: 0.5974 0.0000 6.2798 2.9449 0.0000 3.2122 1.2181 1.6176 7.5271 0.1351 0.0000 0.3737 0.0002 131.3683 92.1336 23.2588 4.3707 0.0000 100.4955 5.2770 0.0000 4.4355 0.0000 5.9120 9.9261 0.0001 0.6720 0.6442 0.0803 0.0005 10.5495 28.9715 0.2206 0.3401 0.1008 1.8816 0.0786 7.3138 17.3773 20.4537 52.9685 103.3448
temp: 298.150 k
press: 1.00000 atm
elementType: 6 6 6 6 6 6 6 6 6 6 1 1 1 1 1 1
symmnumber: 1
zpe: 304531.1 jmol-1
zpe.correction: 0.115990 hartree
zpe.thermalcorrener: 0.124722 hartree
zpe.thermalcorrenthalpy: 0.125666 hartree
zpe.thermalcorrgfe: 0.082529 hartree
zpe.sumelectzpe: -383.875786 hartree
zpe.sumelectthermal: -383.867054 hartree
zpe.sumelectthermalent: -383.866110 hartree
zpe.sumelectthermalfe: -383.909247 hartree
dipole: 0.8642 0.0005 0.0016
dipole: 0.8642
quadrupole: -44.1189 -50.2493 -62.3118
quadrupole: -0.0008 -0.0045 0.0010
quadrupole: 8.1078 1.9773 -10.0851 -0.0008 -0.0045 0.0010
hfenergy: -383.9917759 hartree
pointgroup: C01 [X(C10H6)]
dipole: -0.3400051 -0.0001801 0.0006439 debye
dipolederiv: 0.2219377 0.2075295 0.0000013 0.1678634 0.1439076 0.0000082 0.0000198 -0.0000106 0.0220318 0.2219242 -0.207522 -0.0000096 -0.1678732 0.1439168 -0.0000001 -0.0000014 0.0000131 0.0220294 -0.1701445 -0.0281732 -0.000002 -0.0664538 0.0804742 0.0000213 0.0000056 0.0000216 -0.1422605 -0.170136 0.0281684 -0.0000053 0.0664633 0.0804709 -0.0000094 0.0000139 -0.0000143 -0.1422602 0.0725505 -0.0511465 -0.0000189 -0.0360976 -0.0467281 0.0000058 -0.0000213 0.0000083 -0.1483201 0.0725457 0.0511481 -0.0000215 0.0360944 -0.0467322 -0.0000047 -0.0000259 -0.0000068 -0.1483175 0.0396437 0.1324852 -0.0000394 0.0643448 0.0068799 -0.0000269 -0.0001539 -0.0001405 0.0047767 0.0397044 -0.1324894 -0.0000772 -0.0643079 0.006833 0.0000484 -0.0002768 0.0002417 0.0047772 -0.4041888 -0.1804582 0.0000648 -0.1268267 -0.3982482 0.0000494 0.0002696 0.0002269 -0.3166756 -0.4042931 0.1804646 0.0001268 0.1267288 -0.3981439 -0.0000864 0.0005007 -0.0004126 -0.3166781 0.087872 -0.0091025 0.0000055 0.0159783 -0.0783634 -0.0000093 0.000004 -0.0000097 0.158084 0.087873 0.0091027 0.0000069 -0.0159774 -0.0783654 -0.000002 0.0000062 -0.0000027 0.158083 -0.0792202 0.0766346 0.0000209 0.0920844 0.0397881 -0.0000114 0.0000246 -0.0000132 0.1622824 -0.0792196 -0.0766357 0.0000172 -0.0920842 0.0397872 0.0000056 0.0000217 0.0000097 0.1622828 0.2315529 0.005112 -0.0000244 0.0056083 0.2522885 -0.0000166 -0.0001365 -0.0001095 0.2600819 0.231598 -0.0051175 -0.0000452 -0.0055449 0.2522349 0.0000281 -0.0002503 0.0001984 0.2600827 unknown
polarizability: 161.3057607|-0.0001252|121.9290764|-0.0091531|0.0024721|39.9454989 unknown
InChI: InChI=1S/C10H6/c1-3-9-7-5-6-8-10(9)4-2/h1-2,5-8H
charge 0 multiplicity 1
16 atoms
C  0.037985 0.719302 -0.000006
C  0.037987 -0.719222 -0.00004
C  -1.205288 1.411399 0.000117
C  -1.205284 -1.411323 0.000047
C  -2.425993 0.707881 0.000195
C  -2.425991 -0.707807 0.000157
C  1.266603 1.459544 -0.00006
C  1.266608 -1.45946 -0.000135
C  2.318161 2.10687 -0.000058
C  2.318153 -2.106808 -0.000146
H  -1.195594 2.505844 0.000156
H  -1.195587 -2.505768 0.000031
H  -3.372776 1.258092 0.00029
H  -3.372772 -1.258022 0.000226
H  3.238814 2.660686 0.000348
H  3.238574 -2.661009 0.000576
