program: Gaussian 09
title: 000140856
version: EM64L-G09RevD.01
frameworkgroup: C1[X(C11H13NO2S)]
method: RPBEPBE
basis: SDD
operation: Freq
keyword: #p
keyword: freq=noraman
keyword: PBEPBE/SDD
title: #p freq=noraman PBEPBE/SDD
converged: NO YES NO NO
title: Mulliken charges:
elementType: S O O N C C C C C C C C C C C H H H H H H H H H H H H H
charge: 0.095182 -0.240935 -0.238731 0.258137 0.538967 -0.565932 -0.546245 -0.416454 0.222087 -0.383070 0.197962 -0.340683 -0.537253 -0.539058 -0.527597 0.233193 0.213555 0.242526 0.235662 0.237995 0.243049 0.244817 0.218223 0.216954 0.248760 0.222829 0.219345 0.246714
chargesum: 0.00000
title: Mulliken charges with hydrogens summed into heavy atoms:
elementType: S O O N C C C C C C C C C C C
charge: 0.095182 -0.240935 -0.238731 0.258137 0.538967 -0.119184 -0.303719 -0.180792 0.222087 0.097975 0.197962 -0.095866 0.146684 0.149829 -0.527597
polarizability: 1.78855362e+02 1.64629028e+01 1.80967061e+02 1.42847918e+01 -2.36763241e+00 9.30393673e+01
1716.lowfreq: -11.0857 -6.5012 -0.0014 -0.0001 0.0015 4.9797 9.9718 12.1709 33.2923
frequency: 9.8644 11.2158 33.2740 61.9040 88.4376 105.9476 134.9482 160.5957 178.4261 197.6354 225.9967 252.2185 273.8747 331.6884 356.6350 367.1336 390.9892 395.2936 421.4775 455.8553 474.9669 525.5212 576.7434 608.5733 634.2985 684.4257 731.5648 736.7908 806.3284 848.2527 868.0620 902.5106 927.1435 952.1896 983.4005 999.8341 1026.9566 1107.1283 1110.6527 1112.4963 1133.7271 1143.5947 1156.2873 1177.4174 1194.3196 1222.5282 1244.1827 1263.1013 1279.2466 1317.4766 1346.2418 1396.7787 1411.8098 1436.5657 1444.1811 1463.2494 1464.6908 1466.0944 1467.8597 1470.1911 1472.6507 1508.6414 1592.0233 1612.2100 2215.4049 2953.3885 2957.8784 2967.0468 2994.8217 3020.4405 3039.3547 3045.3492 3059.7112 3125.0241 3126.4349 3134.8955 3139.5229 3166.5430
redmass: 10.6139 6.7720 5.5438 4.9769 3.3711 3.8965 3.1328 3.1128 3.1122 2.8278 1.6462 1.2912 1.8253 3.6866 3.9285 2.8406 12.2037 8.6931 5.1657 3.4263 3.7122 5.1465 3.7120 5.3332 3.6750 4.2073 4.9465 2.9074 1.4418 1.6013 3.4369 2.0190 1.4869 3.2135 8.1874 4.0169 2.0506 4.5340 1.2634 1.2610 2.2402 1.5188 1.4277 1.5726 1.2613 2.0573 1.1550 3.6376 1.4448 1.3156 1.3598 4.3098 2.5738 1.1791 1.4268 1.0839 1.1051 1.0519 1.0507 1.0804 1.0643 2.7324 7.0658 6.6434 12.2103 1.0333 1.0331 1.0575 1.0625 1.1019 1.1037 1.1038 1.1021 1.0986 1.0991 1.0894 1.0900 1.0943
irintensity: 0.4242 0.3204 0.8470 2.2325 14.1136 1.5518 2.7844 1.2107 5.9237 2.2168 0.9387 0.4060 0.4384 1.4324 2.2346 0.9837 0.2818 0.3195 12.1974 0.2499 6.8786 5.7409 7.3014 21.1328 15.4255 1.6777 15.6203 1.8355 41.2836 15.8142 5.8498 16.2775 1.5973 1.6445 29.4016 46.9051 3.5285 3.9800 0.1733 0.2027 131.0464 5.7315 14.9097 26.7964 2.0152 88.9626 1.0197 174.2511 9.9612 16.5893 56.7986 12.2367 22.9939 14.7324 13.9513 22.8331 15.9557 13.4447 16.3591 63.9732 43.0691 135.6640 42.8096 22.6488 854.4132 76.8673 53.6174 45.9375 38.5635 34.8889 49.4402 51.3561 23.5456 22.3961 27.6880 8.7697 12.3484 8.5180
temp: 298.150 k
press: 1.00000 atm
elementType: 16 8 8 7 6 6 6 6 6 6 6 6 6 6 6 1 1 1 1 1 1 1 1 1 1 1 1 1
symmnumber: 1
zpe: 572425.9 jmol-1
zpe.correction: 0.218026 hartree
zpe.thermalcorrener: 0.234045 hartree
zpe.thermalcorrenthalpy: 0.234990 hartree
zpe.thermalcorrgfe: 0.170364 hartree
zpe.sumelectzpe: -1029.075059 hartree
zpe.sumelectthermal: -1029.059039 hartree
zpe.sumelectthermalent: -1029.058095 hartree
zpe.sumelectthermalfe: -1029.122721 hartree
dipole: -2.0915 -3.3508 1.1607
dipole: 4.1170
quadrupole: -112.4558 -73.6354 -97.0103
quadrupole: -8.5852 5.1715 4.7730
quadrupole: -18.0886 20.7317 -2.6431 -8.5852 5.1715 4.7730
hfenergy: -1029.2930848 hartree
pointgroup: C01 [X(C11H13N1O2S1)]
dipole: 0.4273938 1.4541209 0.571333 debye
polarizability: 169.8396989|14.5036074|189.3010735|-14.1603529|5.925728|93.7210184 unknown
InChI: InChI=1S/C11H13NO2S/c1-13-10-4-3-9(5-6-12-8-15)7-11(10)14-2/h3-4,7H,5-6H2,1-2H3
charge 0 multiplicity 1
28 atoms
S  -4.21501 -2.842071 -0.916161
O  2.617017 1.569467 -0.64842
O  3.096005 -1.011886 -0.315547
N  -3.437398 -0.207423 -0.191135
C  -0.654268 0.545493 0.94373
C  -1.997998 1.140247 1.332081
C  0.342524 1.366442 0.348484
C  -0.381425 -0.825649 1.125558
C  1.581467 0.831588 -0.06278
C  -3.046516 1.115869 0.174834
C  1.843869 -0.565786 0.120282
C  0.855607 -1.378258 0.715387
C  2.38795 3.000394 -0.850106
C  3.389125 -2.437519 -0.151218
C  -3.766211 -1.323448 -0.500719
H  -2.428359 0.604171 2.197733
H  -1.882936 2.200817 1.627747
H  0.142467 2.435574 0.216754
H  -1.134886 -1.476676 1.582853
H  -3.947619 1.681672 0.486849
H  -2.622821 1.625615 -0.713059
H  1.038189 -2.44637 0.864017
H  2.218345 3.522896 0.11226
H  1.529102 3.181694 -1.526479
H  3.311541 3.373271 -1.316249
H  2.673376 -3.064775 -0.717815
H  3.376206 -2.732398 0.916501
H  4.401758 -2.567151 -0.559982
