program: Gaussian 09
title: 000140834
version: EM64L-G09RevD.01
frameworkgroup: C1[X(C4H8O)]
method: RPBEPBE
basis: SDD
operation: Freq
keyword: #p
keyword: freq=noraman
keyword: PBEPBE/SDD
title: #p freq=noraman PBEPBE/SDD
converged: NO YES NO NO
title: Mulliken charges:
elementType: O C C C C H H H H H H H H
charge: -0.442752 0.249966 -0.234601 -0.789049 -0.723383 0.223999 0.242370 0.232876 0.231880 0.224980 0.208247 0.225007 0.350462
chargesum: 0.00000
title: Mulliken charges with hydrogens summed into heavy atoms:
elementType: O C C C C
charge: -0.092290 0.249966 -0.010603 -0.081923 -0.065150
polarizability: 6.68428021e+01 -5.86661609e+00 4.58195727e+01 2.69274875e-02 -2.31409698e-03 3.19027662e+01
1716.lowfreq: -13.7780 -0.0006 -0.0006 -0.0005 10.9761 13.6253 79.1470 123.9623 180.1193
frequency: 78.9126 123.9354 180.1176 259.5300 277.6193 412.2408 471.3443 515.0616 768.7952 834.5185 950.5672 1008.0785 1038.2939 1048.6832 1082.8794 1181.0492 1227.1357 1351.7510 1394.8432 1407.3605 1463.5464 1465.7283 1470.2832 1483.0777 1736.3764 2961.3357 2963.4607 3029.8683 3031.1454 3074.7402 3108.7544 3124.2188 3595.5483
redmass: 1.3497 1.0469 1.0672 1.8665 2.7904 2.7507 2.4673 3.4418 3.4677 1.2392 1.5708 1.5865 1.4357 1.4543 2.1607 1.7600 1.7897 1.4703 1.3781 1.2215 1.0454 1.0522 1.0436 1.0610 6.3425 1.0387 1.0384 1.0978 1.0979 1.0964 1.0935 1.0898 1.0664
irintensity: 77.6909 4.9990 25.9434 36.1454 0.7957 3.5053 16.3134 12.3985 9.1348 33.9422 24.6550 7.8360 0.0206 0.5632 100.2973 132.3794 11.5931 38.1903 11.7118 19.3250 1.6701 6.6068 23.9226 13.8489 44.4169 71.9314 20.1435 14.0871 46.4687 30.9346 14.3668 26.1441 23.0198
temp: 298.150 k
press: 1.00000 atm
elementType: 8 6 6 6 6 1 1 1 1 1 1 1 1
symmnumber: 1
zpe: 287826.3 jmol-1
zpe.correction: 0.109627 hartree
zpe.thermalcorrener: 0.116604 hartree
zpe.thermalcorrenthalpy: 0.117548 hartree
zpe.thermalcorrgfe: 0.079340 hartree
zpe.sumelectzpe: -232.007612 hartree
zpe.sumelectthermal: -232.000635 hartree
zpe.sumelectthermalent: -231.999691 hartree
zpe.sumelectthermalfe: -232.037899 hartree
dipole: -0.6506 2.2263 -0.0108
dipole: 2.3194
quadrupole: -25.6395 -32.7977 -33.2471
quadrupole: -3.0555 0.0324 0.0084
quadrupole: 4.9219 -2.2362 -2.6857 -3.0555 0.0324 0.0084
hfenergy: -232.117239 hartree
pointgroup: C01 [X(C4H8O1)]
dipole: -0.1956331 0.8905402 -0.0369306 debye
dipolederiv: -1.1252882 -0.2373263 -0.0179586 -0.5808123 -0.3774845 -0.0268439 -0.0050108 -0.0142922 -0.4452171 1.1674449 0.0455913 0.0445993 0.3153715 0.4305535 -0.0000194 0.0349625 -0.0095292 -0.0410202 -0.1872709 0.0107228 0.0048879 0.2250376 -0.060706 0.0013346 -0.001963 -0.0065448 -0.3150909 -0.0474349 0.0021123 -0.0066313 -0.0875819 -0.1917626 0.0059848 -0.0020529 0.0083744 0.1406848 -0.0011481 -0.0420003 -0.0034737 0.0155909 0.0375177 0.0030548 -0.0055526 0.0008098 0.1219513 0.0419227 -0.02055 -0.0050049 -0.0421922 -0.1177807 0.0068728 -0.0042732 0.0077916 0.1863004 -0.0382713 -0.1502297 -0.0001231 -0.0901684 0.0376672 -0.0007933 -0.0023782 -0.0028155 0.1174692 -0.0076011 0.0850737 0.1140515 0.0665003 0.0334325 -0.0198147 0.1312682 -0.0732217 -0.0420442 0.0073718 0.0734562 -0.1166419 0.0562975 0.0394591 0.0186655 -0.1322854 0.0733395 -0.0639022 -0.0770027 0.0364226 0.1044733 0.0136248 0.0831885 -0.0746614 0.1589642 -0.0660632 -0.0506462 0.0795133 0.0373814 -0.0020117 -0.0464446 -0.1817012 0.00672 0.0007147 0.0098656 0.1001026 -0.0565426 0.0251026 -0.1064455 -0.0015 0.0911174 0.0659097 -0.1595688 0.0593326 -0.0794266 0.2443071 0.1342433 -0.0097212 0.1562769 0.1764989 0.0135905 -0.0128247 0.0129531 0.3708391 unknown
polarizability: 65.8989534|-7.1894805|46.6828846|1.5437391|-0.6988525|31.983303 unknown
InChI: InChI=1S/C4H8O/c1-3-4(2)5/h3,5H,1-2H3
charge 0 multiplicity 1
13 atoms
O  -1.626237 -0.80314 -0.042469
C  -0.452484 0.008741 -0.021219
C  0.7423 -0.63593 0.043535
C  -0.709698 1.498412 -0.072506
C  2.116833 -0.008286 0.078882
H  0.697223 -1.732936 0.072705
H  0.228555 2.073369 -0.05992
H  -1.317235 1.826282 0.794984
H  -1.261018 1.7751 -0.99383
H  2.731744 -0.351217 -0.776616
H  2.086339 1.094738 0.044644
H  2.662306 -0.297552 0.998949
H  -2.433928 -0.236081 -0.096238
