program: Gaussian 09
title: 000140817
version: EM64L-G09RevD.01
frameworkgroup: C1[X(C8F6N2)]
method: RPBEPBE
basis: SDD
operation: Freq
keyword: #p
keyword: freq=noraman
keyword: PBEPBE/SDD
title: #p freq=noraman PBEPBE/SDD
converged: NO NO NO NO
title: Mulliken charges:
elementType: F F F F F F N N C C C C C C C C
charge: -0.126515 -0.126511 -0.132329 -0.132335 -0.124211 -0.124212 0.084753 0.084753 0.022924 0.022932 0.139044 0.139037 0.100299 0.100304 0.036035 0.036033
chargesum: 0.00000
title: Mulliken charges with hydrogens summed into heavy atoms:
polarizability: 1.72878546e+02 -1.71342737e-05 1.08324524e+02 -6.52802222e-05 3.09479094e-04 3.85440551e+01
1716.lowfreq: -0.0012 -0.0010 -0.0008 7.0160 7.0226 9.1998 64.2613 83.5088 143.0804
frequency: 64.2598 83.5086 143.0802 145.4407 179.3270 241.9915 259.2576 266.1934 272.1015 272.4728 278.7832 365.4066 372.0267 406.6668 419.5071 451.4043 466.3862 487.8498 549.7099 611.6405 636.0581 651.4312 654.9264 725.1246 744.4778 764.3498 764.7829 941.4178 986.0055 1090.9494 1111.2666 1134.9351 1277.2127 1282.5096 1335.2309 1401.5791 1420.6435 1467.8486 1472.2249 1555.5647 1565.3678 1625.1728
redmass: 17.9330 17.0247 18.3799 15.8443 17.2427 14.5827 18.7163 18.7156 13.4824 18.2202 17.8424 15.5416 15.8786 12.6786 12.5023 16.2878 12.9739 16.0200 15.2629 14.2240 12.1384 14.4889 12.1536 12.2904 15.1805 12.8048 12.1434 14.0489 13.6427 13.1816 13.2725 13.1788 12.3859 12.4640 12.2491 12.5644 12.5035 12.1771 12.2688 12.8616 12.1169 12.0405
irintensity: 0.0000 0.4006 0.0000 2.0583 0.0110 0.0000 0.0457 0.1484 0.2832 1.4781 0.2193 0.4242 0.5169 0.0000 10.1512 2.2290 9.9557 2.4761 1.3651 19.3099 0.0000 0.1580 0.1418 0.0000 76.1292 15.4698 0.0000 84.0193 35.3646 38.0547 0.0587 97.0829 308.7240 70.3687 2.1177 340.0746 185.6367 153.0644 28.0545 10.9692 3.3016 23.9075
temp: 298.150 k
press: 1.00000 atm
elementType: 9 9 9 9 9 9 7 7 6 6 6 6 6 6 6 6
symmnumber: 1
zpe: 185098.7 jmol-1
zpe.correction: 0.070500 hartree
zpe.thermalcorrener: 0.082977 hartree
zpe.thermalcorrenthalpy: 0.083921 hartree
zpe.thermalcorrgfe: 0.031372 hartree
zpe.sumelectzpe: -1012.234689 hartree
zpe.sumelectthermal: -1012.222212 hartree
zpe.sumelectthermalent: -1012.221268 hartree
zpe.sumelectthermalfe: -1012.273817 hartree
dipole: 0.5944 0.0000 0.0000
dipole: 0.5944
quadrupole: -98.6156 -101.5177 -81.6636
quadrupole: 0.0000 -0.0001 -0.0001
quadrupole: -4.6833 -7.5854 12.2687 0.0000 -0.0001 -0.0001
hfenergy: -1012.3051891 hartree
pointgroup: C01 [X(C8F6N2)]
dipole: -0.2338591 -0.0000068 -0.0000047 debye
dipolederiv: -0.1614756 0.0398729 -0.0000002 0.1733718 -0.9463545 0.0000063 0.0000005 -0.0000048 -0.0779272 -0.1614653 -0.039844 -0.0000004 -0.1733439 -0.9463671 -0.0000024 -0.0000012 0.0000025 -0.0779242 -0.928898 0.3029501 0.0000062 0.4342617 -0.3085908 -0.0000033 -0.0000061 0.0000018 -0.0771493 -0.9288613 -0.3029677 -0.0000017 -0.4342781 -0.3086194 -0.0000012 -0.0000049 -0.0000018 -0.0771539 -1.0862031 -0.3074379 0.0000074 -0.5725748 -0.3788479 0.0000039 0.0000163 0.0000067 -0.1621358 -1.0862356 0.3074118 -0.0000149 0.5725463 -0.3788162 0.0000079 -0.0000397 0.0000133 -0.1621375 -0.3516711 -0.1501661 0.000003 0.2065699 -0.232064 -0.0000002 0.0000079 0.0000049 -0.1722926 -0.3516734 0.1501596 -0.0000158 -0.2065745 -0.232072 -0.0000049 -0.0000108 0.0000075 -0.1722923 0.2361061 0.2676054 -0.0000024 -0.3952147 -0.0968396 -0.0000004 -0.0000021 -0.0000038 0.0498107 0.2361022 -0.2675946 0.0000057 0.3952287 -0.0968329 0.0000021 -0.0000037 -0.0000008 0.0498132 -0.0118219 -0.0405648 0.0000007 -0.2114438 1.1479815 -0.0000062 0.000004 0.0000077 0.0816454 -0.0118287 0.0405246 -0.0000006 0.2113992 1.1479987 0.0000025 0.0000011 -0.000005 0.0816453 1.0238039 -0.4810115 -0.0000069 -0.592957 0.2654567 0.0000037 0.0000041 -0.0000013 0.082378 1.0237476 0.4810335 0.0000025 0.5929792 0.2654911 0.0000008 0.0000065 0.0000014 0.0823767 1.2801609 0.4069408 -0.0000173 1.0376464 0.5492623 -0.000004 -0.0000398 -0.0000084 0.2756717 1.2802134 -0.4069119 0.0000348 -1.0376166 0.5492143 -0.0000045 0.0000679 -0.0000198 0.2756716 unknown
polarizability: 172.8785459|0.0011848|108.3245241|-0.0000653|-0.0003095|38.5440551 unknown
InChI: InChI=1S/C8F6N2/c9-1-2(10)4(12)6-5(3(1)11)15-7(13)8(14)16-6
charge 0 multiplicity 1
16 atoms
F  -1.07243 2.808374 -0.00001
F  -1.072328 -2.808423 -0.000004
F  -3.459191 1.376963 0.00001
F  -3.459143 -1.377102 -0.000005
F  3.717498 1.397461 -0.000029
F  3.71755 -1.397338 0.000052
N  1.396293 1.424017 -0.000014
N  1.396344 -1.423978 0.000002
C  0.200064 0.729444 -0.000004
C  0.200089 -0.729451 0.000006
C  -1.045053 1.42547 -0.000009
C  -1.045002 -1.425524 -0.000004
C  -2.245142 0.712119 0.000011
C  -2.245111 -0.712208 0.000002
C  2.50767 0.721184 -0.00001
C  2.507694 -0.721107 0.000004
