program: Gaussian 09
title: 000011220
version: EM64L-G09RevD.01
frameworkgroup: C1[X(CBrN3O6)]
method: RPBEPBE
basis: SDD
operation: Freq
keyword: #p
keyword: freq=noraman
keyword: PBEPBE/SDD
title: #p freq=noraman PBEPBE/SDD
converged: NO YES NO NO
title: Mulliken charges:
elementType: Br O O O O O O N N N C
charge: 0.281418 -0.123439 -0.123426 -0.123420 -0.117751 -0.117167 -0.117874 0.174083 0.174938 0.174139 -0.081501
chargesum: 0.00000
title: Mulliken charges with hydrogens summed into heavy atoms:
polarizability: 9.02768819e+01 1.98468896e-02 6.82563847e+01 1.92104044e-04 -5.89099930e-02 6.80657470e+01
1716.lowfreq: -6.4417 -4.3263 -0.0002 0.0005 0.0008 2.5515 34.8043 35.3164 88.3161
frequency: 34.7424 35.3025 88.3116 139.9510 140.4939 176.9153 193.3109 193.4131 290.7041 316.1337 318.8242 333.3370 548.9221 557.0517 558.0821 703.8729 704.1215 743.5539 761.8874 765.0237 861.6589 1149.4572 1149.6011 1197.3128 1452.1562 1459.9018 1461.9537
redmass: 16.4797 16.4848 16.0024 17.7331 17.6906 20.7559 17.1834 17.1861 18.1695 15.0757 15.0901 17.1242 14.3907 13.9590 13.9638 14.9427 14.9478 15.2005 13.1140 13.1046 12.6175 15.2035 15.2053 15.0785 14.6247 14.6083 14.6086
irintensity: 0.1700 0.1791 0.0107 0.4455 0.4409 3.6863 1.6548 1.6404 1.2506 0.8915 0.7257 2.8863 6.3566 1.3891 1.1047 60.6961 60.6702 38.7646 33.0675 33.6155 61.9408 128.3602 129.6715 51.9851 131.2682 126.6300 126.9998
temp: 298.150 k
press: 1.00000 atm
elementType: 35 8 8 8 8 8 8 7 7 7 6
symmnumber: 1
zpe: 97711.0 jmol-1
zpe.correction: 0.037216 hartree
zpe.thermalcorrener: 0.048406 hartree
zpe.thermalcorrenthalpy: 0.049350 hartree
zpe.thermalcorrgfe: -0.002337 hartree
zpe.sumelectzpe: -665.999061 hartree
zpe.sumelectthermal: -665.987872 hartree
zpe.sumelectthermalent: -665.986927 hartree
zpe.sumelectthermalfe: -666.038615 hartree
dipole: 2.8720 0.0052 -0.0062
dipole: 2.8721
quadrupole: -69.7426 -76.4721 -76.4593
quadrupole: -0.0123 0.0129 -0.0134
quadrupole: 4.4821 -2.2475 -2.2346 -0.0123 0.0129 -0.0134
hfenergy: -666.0362772 hartree
pointgroup: C01 [X(C1Br1N3O6)]
dipole: -0.0464212 -0.0530824 -1.1277515 debye
dipolederiv: 0.0752303 0.0014407 -0.0242977 -0.0041054 0.0745993 -0.0261028 -0.0242636 -0.025722 -0.4687471 -0.375054 0.0087521 -0.2646761 -0.0411078 -0.4822737 -0.1706594 -0.315285 -0.0898409 -0.3959873 -0.4394734 0.0867686 -0.0255493 0.0501793 -0.3458888 0.3086011 0.0725191 0.3112261 -0.4704835 -0.4129034 -0.0284333 0.2825573 -0.0713148 -0.3992764 -0.1365085 0.2407196 -0.227614 -0.4396019 -0.3317527 0.1673961 -0.2075695 0.1915534 -0.6452987 0.0714262 -0.1801634 0.0378563 -0.2952511 -0.7178905 0.059075 0.1711513 0.0757029 -0.2235788 0.1342437 0.1283893 0.1271498 -0.333768 -0.3978589 -0.2509343 0.0614608 -0.2332777 -0.5772486 -0.1832859 0.0765397 -0.1393909 -0.2966017 0.5139137 -0.1763049 0.5010606 -0.1246196 1.3705332 0.2443327 0.5434617 0.1329583 0.4889572 1.2923933 -0.3456895 -0.0200757 -0.3072553 0.4785121 -0.5476099 -0.142633 -0.5270963 0.6200478 0.9286959 0.4411837 -0.5233013 0.4924376 0.8786857 0.249147 -0.4532862 0.3484834 0.5651989 -0.1353004 0.0367456 0.0492395 -0.0281926 -0.1287654 0.0564158 0.0540017 0.0519903 1.0262368 unknown
polarizability: 68.2332228|-0.0620211|68.1809238|0.9608303|1.0553955|90.184867 unknown
InChI: InChI=1S/CBrN3O6/c2-1(3(6)7,4(8)9)5(10)11
charge 0 multiplicity 1
11 atoms
Br -0.105078 -0.111196 -2.370827
O  0.923437 1.675981 1.041005
O  1.022244 -1.509981 1.191515
O  -1.791639 0.00141 1.240159
O  -0.670717 2.329093 -0.469091
O  2.339031 -0.636769 -0.467118
O  -1.71901 -1.753377 -0.230805
N  0.094427 1.485888 0.093097
N  1.244423 -0.810446 0.150597
N  -1.316472 -0.651561 0.255215
C  -0.020747 -0.018943 -0.433745
