program: Gaussian 09
title: 000140228
version: EM64L-G09RevD.01
frameworkgroup: C1[X(C15H19NSi)]
method: RPBEPBE
basis: SDD
operation: Freq
keyword: #p
keyword: freq=noraman
keyword: PBEPBE/SDD
title: #p freq=noraman PBEPBE/SDD
converged: YES YES NO NO
title: Mulliken charges:
elementType: Si N C C C C C C C C C C C C C C C H H H H H H H H H H H H H H H H H H H
charge: 1.352584 -0.741522 -1.018504 -1.017182 -1.045245 0.441276 0.358084 -0.336956 -0.350882 -0.384227 -0.352534 -0.235242 -0.216185 -0.251123 -0.215918 -0.267421 -0.240579 0.240703 0.230057 0.254566 0.230076 0.240586 0.253521 0.255560 0.256611 0.236303 0.248698 0.253745 0.224488 0.254337 0.218111 0.226689 0.218953 0.226684 0.223646 0.228245
chargesum: 0.00000
title: Mulliken charges with hydrogens summed into heavy atoms:
elementType: Si N C C C C C C C C C C C C C C C
charge: 1.352584 -0.741522 -0.293178 -0.292999 -0.296771 0.441276 0.358084 -0.088258 -0.097138 -0.159739 -0.098197 -0.017131 0.010504 -0.032171 0.010765 -0.043775 -0.012334
polarizability: 2.36238225e+02 5.09043360e+00 1.88211792e+02 5.58601373e-02 2.81262738e-01 1.43823218e+02
1716.lowfreq: -10.7694 -0.0008 0.0009 0.0011 8.5614 11.8330 14.6567 37.3278 58.9864
frequency: 4.8316 36.9176 58.7731 68.9099 79.7124 93.6089 96.0849 125.3486 160.0562 176.5975 196.8102 205.3502 214.3022 238.4891 243.1954 267.1783 303.8333 356.9932 409.5710 415.0429 431.1751 514.5024 525.9072 584.2817 602.3475 614.6257 615.4289 675.7670 687.6145 696.7754 698.4987 703.0330 749.3022 755.2120 764.5586 808.8642 810.3295 830.7570 850.9119 873.2945 884.6352 891.3681 906.9020 909.5887 921.2374 952.3374 959.9231 976.4161 978.1394 978.7838 989.3735 994.5577 1022.4448 1031.0252 1069.3121 1095.7563 1169.1808 1170.5303 1171.9692 1198.4283 1211.8688 1284.6372 1298.4815 1300.2211 1301.1537 1314.8062 1328.7834 1368.3299 1376.2007 1432.3133 1437.2409 1444.7192 1446.3853 1448.8795 1451.6115 1452.4050 1464.0097 1476.4867 1484.4707 1578.1152 1586.3025 1600.5825 1616.6630 2985.5764 2986.2189 2987.6197 3082.8636 3083.8643 3086.8461 3100.7307 3101.4392 3101.8723 3119.4056 3123.3823 3126.6767 3129.9293 3143.1441 3150.4987 3152.7655 3159.7238 3164.9507 3168.9257
redmass: 3.5324 3.5021 2.5667 4.7458 1.4717 1.9346 1.2973 2.5908 1.0181 2.5149 2.8338 4.0578 2.7912 3.1594 3.4542 3.7304 5.0347 4.5454 2.8583 3.0000 4.8738 3.6022 3.1693 6.4569 4.1780 6.4834 6.2559 5.5517 2.5500 2.8643 2.0498 1.7698 1.2206 1.7414 1.9891 1.3350 1.5141 1.2838 1.2437 3.1599 1.4802 2.2279 1.6708 1.5020 1.5131 2.5474 1.3521 1.3220 1.3469 5.6628 4.8081 1.4118 2.0546 2.1778 1.5309 1.5789 1.0551 1.0559 1.1187 1.1182 3.4736 4.1246 1.2590 1.3014 1.2016 1.1920 1.3871 7.9619 5.5634 2.1382 1.0653 1.2415 1.4939 1.0566 1.0549 1.2327 1.0558 2.3886 2.2670 6.1116 6.3664 6.2158 6.1485 1.0351 1.0352 1.0350 1.0979 1.0977 1.0970 1.0984 1.0977 1.0975 1.0846 1.0845 1.0891 1.0880 1.0925 1.0970 1.0921 1.0933 1.1017 1.0992
irintensity: 0.0113 0.0004 0.1699 0.3786 0.3677 0.0726 0.0687 0.0315 0.0008 0.5643 0.7755 1.6646 0.1589 3.0113 1.9088 2.7929 0.1375 15.8637 0.0140 0.5529 10.8980 25.1015 3.0705 2.3193 19.4364 0.0491 1.4231 0.6845 0.0123 12.0014 42.2510 49.7959 1.4178 67.5502 9.2453 15.2873 10.3090 5.9520 0.0017 12.9870 10.5513 2.9676 78.2569 78.6449 188.1005 159.8803 0.1960 0.3211 0.0043 2.6119 2.0872 3.5839 12.3169 21.6811 11.7891 10.5956 0.0019 0.1322 3.9601 11.4958 48.0598 252.6270 33.5611 20.5337 39.2796 39.5219 9.2790 0.2892 8.2218 3.5374 1.9916 3.5847 1.2622 0.0376 13.5183 5.6597 8.2630 86.8027 160.1366 8.8301 3.0204 64.6669 118.1915 14.5155 7.7131 17.9671 6.4320 4.7886 43.4358 8.5279 3.6007 33.1257 6.2754 2.1404 14.0181 2.3963 24.3982 29.0983 40.4507 33.5775 19.3346 5.5618
temp: 298.150 k
press: 1.00000 atm
elementType: 14 7 6 6 6 6 6 6 6 6 6 6 6 6 6 6 6 1 1 1 1 1 1 1 1 1 1 1 1 1 1 1 1 1 1 1
symmnumber: 1
zpe: 774449.2 jmol-1
zpe.correction: 0.294972 hartree
zpe.thermalcorrener: 0.313319 hartree
zpe.thermalcorrenthalpy: 0.314263 hartree
zpe.thermalcorrgfe: 0.246211 hartree
zpe.sumelectzpe: -925.935890 hartree
zpe.sumelectthermal: -925.917544 hartree
zpe.sumelectthermalent: -925.916600 hartree
zpe.sumelectthermalfe: -925.984651 hartree
dipole: -1.7353 1.3587 0.0026
dipole: 2.2039
quadrupole: -104.1053 -104.1286 -108.5014
quadrupole: 5.4712 0.0108 0.0770
quadrupole: 1.4732 1.4498 -2.9230 5.4712 0.0108 0.0770
hfenergy: -926.2308623 hartree
pointgroup: C01 [X(C15H19N1Si1)]
dipole: 0.7181777 0.4826341 0.0560464 debye
polarizability: 231.7429592|-6.5360827|187.8393283|17.7922747|-8.7551138|148.690947 unknown
InChI: InChI=1S/C15H19NSi/c1-17(2,3)16(14-10-6-4-7-11-14)15-12-8-5-9-13-15/h4-13H,1-3H3
charge 0 multiplicity 1
36 atoms
Si 0.168392 2.300397 -0.287416
N  -0.032974 0.494338 -0.026967
C  -0.888472 3.269845 0.978841
C  -0.284032 2.762415 -2.088055
C  2.008049 2.69857 0.008699
C  -1.262866 -0.21344 -0.148452
C  1.148533 -0.274646 0.320088
C  -1.331481 -1.623306 0.075163
C  1.962263 -0.834204 -0.696653
C  -2.475327 0.457477 -0.497494
C  1.508808 -0.461304 1.678058
C  -2.552906 -2.317415 -0.045213
C  3.13159 -1.554093 -0.360712
C  -3.68961 -0.248112 -0.614429
C  2.678073 -1.181325 2.014375
C  -3.74637 -1.642989 -0.390321
C  3.493992 -1.72761 0.995835
H  -0.488957 3.118886 1.998372
H  -0.853363 4.353154 0.756904
H  -1.945769 2.955135 0.983033
H  -0.245867 3.860009 -2.221842
H  0.443289 2.309832 -2.786708
H  -1.290221 2.4165 -2.379357
H  2.32005 2.446982 1.03738
H  2.664435 2.146772 -0.686628
H  2.176079 3.781136 -0.146462
H  -0.425743 -2.174312 0.343917
H  1.666201 -0.701235 -1.743303
H  -2.48036 1.535693 -0.681638
H  0.864511 -0.040614 2.458182
H  -2.567554 -3.399234 0.13372
H  3.756803 -1.978446 -1.154526
H  -4.599613 0.30126 -0.884006
H  2.950898 -1.315525 3.067308
H  -4.692045 -2.187107 -0.482197
H  4.401264 -2.283981 1.2564
