program: Gaussian 09
title: 000140204
version: EM64L-G09RevD.01
frameworkgroup: C1[X(C4H2Cl2S)]
method: RPBEPBE
basis: SDD
operation: Freq
keyword: #p
keyword: freq=noraman
keyword: PBEPBE/SDD
title: #p freq=noraman PBEPBE/SDD
converged: NO NO NO NO
title: Mulliken charges:
elementType: Cl Cl S C C C C H H
charge: -0.033901 0.028518 0.350153 -0.010489 0.073317 -0.445396 -0.540531 0.286270 0.292058
chargesum: 0.00000
title: Mulliken charges with hydrogens summed into heavy atoms:
elementType: Cl Cl S C C C C
charge: -0.033901 0.028518 0.350153 0.275782 0.073317 -0.445396 -0.248473
polarizability: 1.10641506e+02 1.63045529e-01 7.62720099e+01 -1.03696417e-03 4.40528974e-04 2.68092023e+01
1716.lowfreq: -1.8944 -0.0036 0.0023 0.0028 8.6344 12.8587 150.0101 174.4886 228.2948
frequency: 150.0076 174.4881 228.2921 299.5908 362.4532 429.4320 431.8687 577.6504 629.5784 701.1304 760.7989 826.0897 829.8227 958.4154 1080.4076 1165.6903 1319.2336 1464.6046 1527.2274 3210.8971 3249.4585
redmass: 7.9122 20.7198 8.8711 10.3239 21.5660 5.2694 10.9080 3.5620 8.8606 1.2909 7.2340 1.3645 6.9005 6.3911 1.5618 1.2359 3.3846 9.6436 7.2209 1.0969 1.0971
irintensity: 0.1464 0.3581 0.0001 0.1980 1.1641 2.5320 6.6374 17.6297 7.4411 53.5053 37.2492 36.6984 41.0394 42.5721 4.6437 13.4569 30.5826 38.4612 67.5134 2.8137 6.4693
temp: 298.150 k
press: 1.00000 atm
elementType: 17 17 16 6 6 6 6 1 1
symmnumber: 1
zpe: 121882.3 jmol-1
zpe.correction: 0.046423 hartree
zpe.thermalcorrener: 0.053119 hartree
zpe.thermalcorrenthalpy: 0.054063 hartree
zpe.thermalcorrgfe: 0.014181 hartree
zpe.sumelectzpe: -1471.265071 hartree
zpe.sumelectthermal: -1471.258374 hartree
zpe.sumelectthermalent: -1471.257430 hartree
zpe.sumelectthermalfe: -1471.297312 hartree
dipole: 0.0157 0.5878 0.0001
dipole: 0.5880
quadrupole: -64.1361 -55.9973 -63.7834
quadrupole: -2.1185 -0.0001 0.0001
quadrupole: -2.8305 5.3083 -2.4778 -2.1185 -0.0001 0.0001
hfenergy: -1471.3114932 hartree
pointgroup: C01 [X(C4H2Cl2S1)]
dipole: 0.0011993 0.2313522 -0.0000276 debye
dipolederiv: -0.6484446 0.2282946 0.0000007 0.2193284 -0.196832 0. 0.0000118 -0.0000046 -0.0278768 -0.6632513 -0.2244077 0.0000093 -0.2476886 -0.182525 0.0000025 -0.0000081 -0.0000035 0.0253605 -0.2231067 0.0972741 0.000003 0.0729846 -0.1847148 0.0000036 0.0000049 -0.0000006 0.20649 -0.5320329 0.1192533 0.0000016 0.0920297 -0.2234569 0.0000014 0.0000001 -0.0000028 -0.0708408 0.9837401 -0.3038475 -0.0000012 -0.1852256 0.2122498 -0.0000035 -0.0000111 0.0000028 -0.045803 0.9155051 0.2854952 -0.0000114 0.2188447 0.6161534 -0.0000041 0.0000125 0.0000024 -0.2337665 0.0044766 -0.1918431 -0.0000062 -0.1638297 -0.1641897 -0.0000007 -0.0000112 0.0000088 -0.3006645 0.1203651 0.0253165 0.0000011 -0.0135067 0.0276885 -0.000002 -0.0000022 -0.0000037 0.2129515 0.0427486 -0.0355355 0.0000032 0.0070633 0.0956269 0.0000027 0.0000034 0.0000011 0.2341495 unknown
polarizability: 110.5960779|-1.2593165|76.3174385|-0.0010505|-0.0004072|26.8092023 unknown
InChI: InChI=1S/C4H2Cl2S/c5-3-1-4(6)7-2-3/h1-2H
charge 0 multiplicity 1
9 atoms
Cl 2.823255 -0.757992 -0.000015
Cl -2.847909 -0.842884 0.000034
S  -0.885864 1.574837 0.000003
C  -0.013065 -0.945798 -0.000009
C  1.147177 -0.087542 -0.000006
C  -1.179608 -0.207227 0.000029
C  0.886075 1.267553 -0.000039
H  0.029678 -2.035483 -0.000028
H  1.582561 2.102537 -0.00007
