program: Gaussian 09
title: 000140180
version: EM64L-G09RevD.01
frameworkgroup: C1[X(C5H12O2)]
method: RPBEPBE
basis: SDD
operation: Freq
keyword: #pfreq=noraman
keyword: PBEPBE/SDD
title: #p freq=noraman PBEPBE/SDD
converged: NO NO NO NO
title: Mulliken charges:
elementType: O O C C C C C H H H H H H H H H H H H
charge: -0.267990 -0.267982 -0.405154 -0.253610 -0.253615 -0.498750 -0.498738 0.231139 0.230978 0.180253 0.180077 0.180238 0.180101 0.198507 0.234508 0.198506 0.234514 0.198504 0.198513
chargesum: 0.00000
title: Mulliken charges with hydrogens summed into heavy atoms:
elementType: O O C C C C C
charge: -0.267990 -0.267982 0.056963 0.106720 0.106724 0.132771 0.132794
polarizability: 8.35414460e+01 6.11299463e-04 5.41257101e+01 -7.19783382e-04 -6.64926567e-03 5.17616967e+01
1716.lowfreq: -0.0008 -0.0003 0.0003 7.1981 9.3399 44.8924 53.5559 76.2202 104.6711
frequency: 53.2196 76.2192 104.6711 116.0414 134.3910 233.8483 234.8056 255.9968 307.6776 408.0976 500.7287 793.4848 862.7131 885.7101 912.7889 1053.6402 1057.3999 1082.7188 1094.3974 1106.6814 1114.2598 1140.7631 1152.2770 1171.0211 1179.5998 1262.7149 1268.9738 1290.8180 1380.8989 1393.7782 1439.7083 1439.9842 1457.3716 1457.3761 1469.1978 1469.3198 1478.0148 1490.3696 1500.0800 2889.8456 2897.0873 2915.2374 2916.8512 2933.9798 2940.2626 2984.2305 2984.4111 3022.1504 3088.8393 3098.5938 3098.7493
redmass: 2.9565 2.2637 3.2282 2.3346 2.2584 1.1930 1.1585 3.1523 5.1260 3.1001 3.0637 1.0758 5.6761 1.1603 5.6085 3.3877 6.3556 2.6872 6.6401 1.2817 1.2441 1.5328 1.3862 1.6298 1.1796 1.2072 1.0808 1.3407 1.2738 1.4452 1.1562 1.1765 1.0513 1.0514 1.0620 1.0632 1.0719 1.0757 1.0838 1.0529 1.0528 1.0354 1.0366 1.1067 1.1049 1.1023 1.1023 1.0594 1.1045 1.0966 1.0966
irintensity: 0.3921 0.0001 0.5999 0.0000 8.9249 7.9669 0.0408 6.8421 0.0327 8.1524 5.6753 3.7695 0.1074 0.0004 31.5050 1.7361 173.2453 62.3654 0.0042 0.9752 0.0008 6.4162 13.9597 0.1236 0.0000 0.0115 0.0008 5.4618 1.6549 42.2413 0.3281 2.2977 0.0004 24.6292 23.3813 5.3218 0.9835 0.4770 5.4791 25.3596 76.7001 100.0866 124.8532 0.0030 146.9025 0.7311 159.9721 18.5080 38.3378 28.3282 36.9891
temp: 298.150 k
press: 1.00000 atm
elementType: 8 8 6 6 6 6 6 1 1 1 1 1 1 1 1 1 1 1 1
symmnumber: 1
zpe: 434256.4 jmol-1
zpe.correction: 0.165400 hartree
zpe.thermalcorrener: 0.174967 hartree
zpe.thermalcorrenthalpy: 0.175911 hartree
zpe.thermalcorrgfe: 0.130380 hartree
zpe.sumelectzpe: -347.520312 hartree
zpe.sumelectthermal: -347.510745 hartree
zpe.sumelectthermalent: -347.509801 hartree
zpe.sumelectthermalfe: -347.555332 hartree
dipole: -0.0009 3.2683 0.0096
dipole: 3.2683
quadrupole: -35.8148 -46.4812 -44.2479
quadrupole: 0.0020 -0.0080 -0.0061
quadrupole: 6.3665 -4.2999 -2.0666 0.0020 -0.0080 -0.0061
hfenergy: -347.6857117 hartree
pointgroup: C01 [X(C5H12O2)]
dipole: 0.0003405 -1.2858495 -0.0010515 debye
dipolederiv: -1.1140202 0.0014911 0.0005497 -0.0552538 -0.402766 0.0001259 0.0002659 -0.0004142 -0.4407433 -1.1142375 -0.0020777 -0.0009159 0.0547507 -0.4026438 0.0002472 -0.0004019 -0.0004309 -0.4407854 -0.1910357 -0.0001553 -0.0000802 -0.0001949 0.05054 0.0000596 -0.0000774 0.0003541 0.1081386 0.6809663 0.1318945 -0.0008722 0.222635 0.3483875 0.0001701 -0.0002503 0.0003188 0.4786165 0.6813939 -0.1316695 0.0009093 -0.2223823 0.3480775 -0.0001519 -0.0001407 0.0000053 0.4786789 0.6336348 -0.1029001 -0.0000005 -0.2725556 0.291694 0.0002499 -0.0000784 0.0002879 0.3825051 0.6334081 0.1032344 0.000275 0.2727889 0.2919928 0.0002054 0.0007047 0.0001878 0.3825399 0.0819131 0.0001348 0.000104 0.0001067 0.0008523 -0.0968519 0.000128 -0.1080783 -0.0489734 0.0811732 -0.0000199 -0.000024 0.0000005 0.0025828 0.0966144 -0.0000163 0.1078316 -0.0513665 -0.0301341 0.0000109 -0.0249621 -0.0592278 -0.0865495 0.1213303 0.0130748 0.1613433 -0.1358052 -0.0300402 0.0010034 0.0257894 -0.0586559 -0.0887057 -0.1216566 -0.0119739 -0.1616241 -0.1335379 -0.0301841 0.0000941 0.0247428 0.0593979 -0.0868618 0.1214538 -0.0132416 0.1614341 -0.1355199 -0.030101 -0.0009352 -0.0256992 0.0586711 -0.088298 -0.121594 0.0122152 -0.1615548 -0.1338476 -0.0111133 0.0143145 0.0117926 0.1361231 -0.0370926 0.1428014 -0.0685349 0.1422209 -0.1342362 -0.1044236 -0.0946238 0.0002154 -0.1307163 -0.0144306 0.0002698 0.0003454 0.0002659 0.1130237 -0.0108308 0.0138102 -0.012275 0.1358318 -0.0375951 -0.1432028 0.067857 -0.1424048 -0.1337394 -0.1045632 0.0945289 -0.0001387 0.1306229 -0.0142818 0.0001034 -0.0002138 0.0000913 0.1130236 -0.0110933 -0.01439 -0.0118253 -0.1363259 -0.0377225 0.1429018 0.0682783 0.1424567 -0.1337035 -0.0107126 -0.0137455 0.012415 -0.1356158 -0.0371794 -0.1430759 -0.0679401 -0.1422906 -0.1342681 unknown
polarizability: 83.5414375|0.0148502|54.1256787|0.0057576|-0.0116645|51.7617366 unknown
InChI: InChI=1S/C5H12O2/c1-6-4-3-5-7-2/h3-5H2,1-2H3
charge 0 multiplicity 1
19 atoms
O  2.414465 0.471817 -0.001556
O  -2.412913 0.469007 -0.00119
C  0.00064 0.408721 -0.005559
C  1.273334 -0.446394 0.000035
C  -1.27092 -0.447994 -0.000816
C  3.693002 -0.231511 -0.002165
C  -3.690986 -0.23519 -0.003683
H  -0.000138 1.067196 0.88137
H  0.000586 1.057551 -0.899522
H  1.310406 -1.099981 0.903868
H  1.313831 -1.107324 -0.898295
H  -1.30712 -1.10268 0.902251
H  -1.310738 -1.10792 -0.899903
H  3.810364 -0.870555 0.900857
H  4.474612 0.544907 -0.003715
H  3.8083 -0.87228 -0.904226
H  -4.473128 0.540681 -0.004217
H  -3.808393 -0.875945 0.898126
H  -3.805401 -0.874407 -0.906959
