program: Gaussian 09
title: 000140165
version: EM64L-G09RevD.01
frameworkgroup: C1[X(C7H5FN2O4)]
method: RPBEPBE
basis: SDD
operation: Freq
keyword: #p
keyword: freq=noraman
keyword: PBEPBE/SDD
title: #p freq=noraman PBEPBE/SDD
converged: YES YES NO NO
title: Mulliken charges:
elementType: F O O O O N N C C C C C C C H H H H H
charge: -0.116720 -0.170988 -0.143214 -0.125738 -0.136634 0.106889 0.103343 0.146787 0.358021 -0.288384 -0.356462 -0.226440 -0.204913 -0.215205 0.272327 0.268490 0.242946 0.243153 0.242744
chargesum: 0.00000
title: Mulliken charges with hydrogens summed into heavy atoms:
elementType: F O O O O N N C C C C C C C
charge: -0.116720 -0.170988 -0.143214 -0.125738 -0.136634 0.106889 0.103343 0.146787 0.358021 -0.016057 -0.087973 0.016506 0.038239 0.027539
polarizability: 1.41909761e+02 6.62588743e+00 9.06052726e+01 -7.90516264e-02 1.81729251e+01 8.53528304e+01
1716.lowfreq: -6.2159 -0.0007 -0.0006 0.0005 4.4388 8.9757 39.1349 52.0332 62.1509
frequency: 39.0687 51.9465 62.1467 93.6798 141.9094 165.7234 230.0734 268.4332 294.3587 308.3451 343.3645 383.9626 397.2132 454.7122 483.4842 587.4392 613.2529 623.4631 678.1936 691.0898 712.5284 739.4117 749.7036 819.6088 855.9282 902.3669 947.0096 987.0231 989.0778 1007.7691 1026.8371 1058.4420 1107.9325 1171.7217 1180.8259 1202.1500 1206.0047 1260.0810 1328.1896 1387.0430 1435.6418 1449.4349 1450.0589 1481.1639 1589.1225 1608.9863 3140.6290 3152.9171 3164.0208 3175.0802 3181.8645
redmass: 7.5709 6.9604 12.1600 7.2581 10.8371 8.8717 6.0871 8.2798 12.3945 12.5722 10.9054 12.1551 2.8442 8.2582 4.7241 10.8837 6.4991 11.2267 8.1374 2.8356 3.0532 3.2415 9.0773 3.4473 1.2469 8.6223 1.4273 1.3903 6.2009 1.3338 2.7644 3.0843 1.8726 14.1275 1.0573 1.1398 11.1384 5.2241 1.3140 8.7447 2.8232 10.2084 7.1124 2.2108 6.0167 5.8821 1.0862 1.0893 1.0937 1.0961 1.1006
irintensity: 0.0561 0.0421 0.0814 0.1676 3.3374 1.6163 0.0292 4.3314 1.0627 0.6265 0.6398 1.3030 0.0918 0.6212 9.1957 9.4174 0.2278 8.5327 11.7782 5.0220 147.1256 4.1805 26.0589 14.3886 0.6593 33.1692 1.0308 0.5741 1.0879 0.1025 11.4095 35.3368 1.2665 126.1140 0.5552 5.2097 55.2192 143.6724 7.6205 0.5294 110.8849 90.7048 117.6585 2.2831 0.9834 12.7523 0.4216 8.4658 11.0101 4.0704 8.8477
temp: 298.150 k
press: 1.00000 atm
elementType: 9 8 8 8 8 7 7 6 6 6 6 6 6 6 1 1 1 1 1
symmnumber: 1
zpe: 313304.6 jmol-1
zpe.correction: 0.119331 hartree
zpe.thermalcorrener: 0.131570 hartree
zpe.thermalcorrenthalpy: 0.132514 hartree
zpe.thermalcorrgfe: 0.079479 hartree
zpe.sumelectzpe: -778.773058 hartree
zpe.sumelectthermal: -778.760820 hartree
zpe.sumelectthermalent: -778.759876 hartree
zpe.sumelectthermalfe: -778.812911 hartree
dipole: 5.3996 -0.2568 -0.4128
dipole: 5.4214
quadrupole: -74.2153 -85.9354 -78.2771
quadrupole: -0.8854 0.7199 5.6674
quadrupole: 5.2607 -6.4595 1.1988 -0.8854 0.7199 5.6674
hfenergy: -778.8923898 hartree
pointgroup: C01 [X(C7H5F1N2O4)]
dipole: -2.1253906 -0.046498 0.1734082 debye
dipolederiv: -0.3428815 -0.0317448 -0.1158146 -0.012287 -0.2222876 0.0273484 -0.0463409 0.0201447 -0.6210552 -0.2435902 0.0890428 0.1048438 0.163131 -0.4274113 0.0102907 0.1594683 0.0571915 -0.6692282 -0.5587683 0.0016207 -0.0688172 0.1123869 -0.615318 0.1442687 -0.1933265 0.2024046 -0.1927372 -0.209418 0.2315024 -0.0268706 0.3676267 -0.6911212 0.1803602 0.0475271 0.079451 -0.4061825 -0.8597011 -0.0820429 -0.1728946 -0.1839616 -0.4166764 0.0306915 -0.0925269 0.0911814 -0.1964533 0.1114814 -0.4683577 -0.0965066 -0.6829836 1.0516769 -0.1656351 -0.283171 -0.0451349 0.9451223 1.1079133 0.1365003 0.2867834 0.0886264 1.0437964 -0.1831947 0.3246537 -0.3982965 0.1604252 1.1452678 0.1232633 0.1403826 0.1201786 0.2410255 0.0155366 0.0771203 0.0322774 0.8493843 -0.395486 -0.0190234 -0.0735064 -0.0315637 -0.2006595 -0.0425473 0.0373525 -0.0324655 -0.0984357 0.1205857 0.0535532 -0.1176637 0.0298983 -0.0346607 -0.0174963 0.109489 0.0129939 -0.0332882 0.0838403 -0.0286331 0.1318139 0.0527337 -0.1102735 -0.0287026 -0.1577099 -0.0216215 0.0196462 -0.1706694 -0.038652 0.1578535 -0.0589297 -0.1153144 -0.0483817 0.1392768 -0.0512215 0.0942795 -0.0778883 0.0491529 -0.1837969 0.0307926 -0.1168227 -0.0331246 -0.1713088 -0.0288179 0.0018483 0.1657462 0.0051199 0.0252559 0.0041341 -0.1115649 -0.0288941 0.0211344 -0.0367899 0.0254548 0.0640028 -0.0199512 0.0654328 -0.0031548 0.1239177 0.0134999 0.0698192 0.0021308 0.0647801 0.0990373 0.0121775 -0.0560727 0.0123957 0.147415 0.0306226 -0.0339232 0.0257839 0.0175272 0.0537152 0.0068179 -0.0508954 0.0119479 0.1498581 0.0439743 -0.0686277 0.0419542 -0.0489364 0.003446 -0.0200913 0.079755 -0.0281481 0.1539445 0.040595 0.0880131 0.0388223 -0.0087081 -0.0966332 -0.0002544 -0.0292823 0.0071768 0.150476 0.0107885 -0.0269195 0.0100121 0.096557 unknown
polarizability: 141.9761543|-5.3468002|76.1059297|3.0801561|-14.1144422|99.7857802 unknown
InChI: InChI=1S/C7H5FN2O4/c8-7(9(11)12,10(13)14)6-4-2-1-3-5-6/h1-5H
charge 0 multiplicity 1
19 atoms
F  1.152929 -0.29957 1.77025
O  1.689591 -0.881553 -1.677863
O  0.941585 2.244031 -0.49514
O  1.903859 -2.230632 0.160364
O  2.843915 1.290551 0.340411
N  1.556193 -1.165929 -0.435633
N  1.602361 1.299141 0.043516
C  0.812499 -0.051278 0.432789
C  -0.660934 -0.030569 0.1880
C  -1.172374 0.227171 -1.110917
C  -1.54207 -0.287601 1.269491
C  -2.565738 0.229583 -1.317792
C  -2.934964 -0.279603 1.049661
C  -3.44907 -0.021107 -0.241505
H  -0.492837 0.422044 -1.945511
H  -1.140689 -0.490895 2.266265
H  -2.962067 0.430146 -2.318115
H  -3.615264 -0.476571 1.884289
H  -4.531325 -0.016955 -0.409561
