program: Gaussian 09
title: 000140164
version: EM64L-G09RevD.01
frameworkgroup: C1[X(C3H8O)]
method: RPBEPBE
basis: SDD
operation: Freq
keyword: #p
keyword: freq=noraman
keyword: PBEPBE/SDD
title: #p freq=noraman PBEPBE/SDD
converged: NO YES NO YES
title: Mulliken charges:
elementType: O C C C H H H H H H H H
charge: -0.276724 -0.212063 -0.670234 -0.497569 0.185305 0.185305 0.199864 0.228721 0.228721 0.198144 0.232388 0.198142
chargesum: 0.00000
title: Mulliken charges with hydrogens summed into heavy atoms:
elementType: O C C C
charge: -0.276724 0.158548 -0.012928 0.131104
polarizability: 4.51333523e+01 6.82437565e-01 3.39236934e+01 -3.54986384e-05 -2.96932403e-05 3.27754544e+01
1716.lowfreq: -5.9427 0.0001 0.0007 0.0011 2.4170 26.2170 107.3470 214.5642 254.4033
frequency: 107.3317 214.5346 254.2572 270.2035 440.5505 805.0837 819.3026 996.2234 1079.1671 1094.1919 1107.7406 1144.7686 1174.6345 1251.2118 1367.4695 1393.4558 1438.4924 1456.6939 1458.9458 1469.8119 1481.5938 1496.0807 2901.6238 2916.1004 2947.8783 2982.6799 2991.9325 3088.9819 3097.0194 3100.8415
redmass: 2.5237 1.0477 1.2169 2.4930 2.9114 2.7927 1.0836 2.9108 3.3078 2.1196 1.2517 1.4661 1.6380 1.1494 1.2816 1.2675 1.1528 1.0514 1.0411 1.0604 1.0440 1.0798 1.0513 1.0380 1.1064 1.1023 1.0358 1.0988 1.0965 1.1010
irintensity: 5.1865 1.5409 2.5839 5.0851 1.1151 8.6895 4.2457 17.7690 95.6499 13.5364 0.8430 7.3398 16.0852 0.0123 8.5856 29.5460 1.0269 10.2695 12.3729 15.7600 1.8897 5.4820 51.9775 113.9030 81.4832 81.8729 21.9574 36.0456 34.4077 40.1236
temp: 298.150 k
press: 1.00000 atm
elementType: 8 6 6 6 1 1 1 1 1 1 1 1
symmnumber: 1
zpe: 277227.4 jmol-1
zpe.correction: 0.105590 hartree
zpe.thermalcorrener: 0.111260 hartree
zpe.thermalcorrenthalpy: 0.112205 hartree
zpe.thermalcorrgfe: 0.077625 hartree
zpe.sumelectzpe: -193.957963 hartree
zpe.sumelectthermal: -193.952293 hartree
zpe.sumelectthermalent: -193.951349 hartree
zpe.sumelectthermalfe: -193.985929 hartree
dipole: -0.2982 1.6689 0.0000
dipole: 1.6953
quadrupole: -22.6694 -27.1733 -26.2248
quadrupole: -0.2192 0.0000 0.0000
quadrupole: 2.6864 -1.8174 -0.8690 -0.2192 0.0000 0.0000
hfenergy: -194.0635537 hartree
pointgroup: C01 [X(C3H8O1)]
dipole: -0.1046385 -0.6587289 -0.0000059 debye
dipolederiv: -1.0490751 0.0483067 -0.0000021 0.1262771 -0.447077 0.0000025 -0.000003 0.0000007 -0.4527328 0.6388286 -0.164991 0.0000005 -0.3040169 0.4177385 -0.0000024 -0.0000003 -0.0000022 0.4735572 -0.1408386 -0.0573562 -0.0000013 -0.0580556 0.037494 -0.0000009 -0.0000015 -0.0000006 0.0557718 0.6344761 0.0726679 -0.0000003 0.2125466 0.2709435 -0.0000024 0. -0.0000021 0.3900385 -0.0306056 -0.0266421 0.0566757 0.057067 -0.0919386 0.1267374 0.006076 0.1698688 -0.1382064 -0.0306046 -0.0266399 -0.0566743 0.0570681 -0.0919378 -0.1267367 -0.0060749 -0.1698686 -0.1382078 -0.0894847 0.1102378 -0.0000019 0.1438704 -0.0270965 0.0000017 -0.0000019 0.0000013 0.110331 0.0926985 -0.0105486 0.0022071 -0.0564989 0.0123145 0.1145632 0.0321387 0.1231903 -0.0688678 0.0926999 -0.010546 -0.0022043 -0.056497 0.0123132 -0.1145644 -0.0321355 -0.1231905 -0.0688656 -0.0219965 -0.0178536 -0.0028988 -0.1300269 -0.0268613 -0.1457757 -0.0790932 -0.1389502 -0.1379079 -0.0740999 0.1012211 -0.0000008 0.1382969 -0.0390261 0. -0.0000002 -0.0000003 0.112996 -0.0219982 -0.0178562 0.0029006 -0.1300308 -0.0268666 0.1457776 0.0790958 0.1389534 -0.1379062 unknown
polarizability: 45.1555195|-0.4655557|33.9015261|0.0000361|-0.000029|32.7754544 unknown
InChI: InChI=1S/C3H8O/c1-3-4-2/h3H2,1-2H3
charge 0 multiplicity 1
12 atoms
O  -0.523031 0.476119 -0.000017
C  0.529601 -0.545924 -0.000014
C  1.874756 0.180724 -0.000006
C  -1.861047 -0.104986 -0.00003
H  0.428002 -1.195926 0.900016
H  0.428012 -1.195924 -0.900046
H  2.707543 -0.546813 0.000003
H  1.965862 0.820475 -0.894702
H  1.965846 0.820483 0.894686
H  -2.03741 -0.731527 -0.902423
H  -2.567311 0.740739 -0.000026
H  -2.037422 -0.731539 0.90236
