program: Gaussian 09
title: 000140140
version: EM64L-G09RevD.01
frameworkgroup: C1[X(C8H8BrCl)]
method: RPBEPBE
basis: SDD
operation: Freq
keyword: #p
keyword: freq=noraman
keyword: PBEPBE/SDD
title: #p freq=noraman PBEPBE/SDD
converged: NO YES NO NO
title: Mulliken charges:
elementType: Br Cl C C C C C C C C H H H H H H H H
charge: -0.032680 -0.059911 -0.505211 0.489668 -0.368682 -0.402582 -0.670066 -0.082402 -0.200254 -0.236016 0.242627 0.244007 0.263072 0.241431 0.290307 0.292000 0.234973 0.259719
chargesum: 0.00000
title: Mulliken charges with hydrogens summed into heavy atoms:
elementType: Br Cl C C C C C C C C
charge: -0.032680 -0.059911 -0.018577 0.489668 -0.105609 -0.161152 -0.087759 -0.082402 0.034719 0.023703
polarizability: 1.67614490e+02 -2.19297258e+00 1.06207022e+02 -1.28045602e+01 -4.84597098e+00 5.52752481e+01
1716.lowfreq: -0.0020 -0.0015 -0.0012 2.8645 4.7119 10.3956 29.2257 72.1243 75.5919
frequency: 29.1209 72.0936 75.5904 169.1946 180.3118 228.3137 259.4065 369.7511 394.5544 437.4749 523.9376 531.3796 633.9288 671.0533 706.9003 769.5484 792.9375 846.8378 895.4213 910.3611 957.4515 981.1339 984.8033 1035.2341 1073.2601 1079.4124 1119.7916 1178.4388 1207.9849 1229.2330 1264.8681 1296.7608 1309.9109 1378.1824 1421.6911 1451.4128 1463.6522 1479.5721 1577.2777 1605.4865 3015.7346 3054.7326 3075.9507 3128.8645 3141.9210 3148.0368 3151.4576 3174.0651
redmass: 5.5616 2.6617 4.8233 9.3730 5.3070 4.7743 4.1277 3.7548 5.9478 3.0506 6.2501 5.1167 5.0872 5.5985 2.3352 1.1366 1.4761 4.0279 1.5066 1.3883 1.4109 1.3462 5.8512 4.6503 2.1267 1.4627 1.1596 1.0901 2.3852 1.1919 1.2391 1.2491 1.3662 8.2604 2.5649 1.0968 2.3699 1.1036 6.4278 6.7663 1.0598 1.0563 1.1039 1.0881 1.1113 1.0928 1.0931 1.0979
irintensity: 0.3945 1.8423 0.1475 1.7102 0.5995 2.0290 4.3035 3.5970 4.2043 7.1127 28.1719 4.6528 28.3779 11.7802 45.3118 5.1266 43.5966 40.5638 13.0997 1.1933 0.9207 0.3884 3.1603 12.2085 20.2472 6.6988 2.9509 0.5757 10.9924 29.9502 0.5361 0.9704 22.7898 0.4485 20.5552 3.7684 31.9902 7.9119 46.7371 22.7526 12.7368 15.9102 6.5455 5.8528 6.2319 6.8575 9.0341 6.5290
temp: 298.150 k
press: 1.00000 atm
elementType: 35 17 6 6 6 6 6 6 6 6 1 1 1 1 1 1 1 1
symmnumber: 1
zpe: 355796.0 jmol-1
zpe.correction: 0.135516 hartree
zpe.thermalcorrener: 0.145405 hartree
zpe.thermalcorrenthalpy: 0.146349 hartree
zpe.thermalcorrgfe: 0.097096 hartree
zpe.sumelectzpe: -782.442715 hartree
zpe.sumelectthermal: -782.432826 hartree
zpe.sumelectthermalent: -782.431881 hartree
zpe.sumelectthermalfe: -782.481134 hartree
dipole: 1.0691 2.0797 -0.1693
dipole: 2.3445
quadrupole: -87.6546 -70.4979 -77.3265
quadrupole: 4.7491 -2.0187 -1.5889
quadrupole: -9.1616 7.9951 1.1665 4.7491 -2.0187 -1.5889
hfenergy: -782.5782301 hartree
pointgroup: C01 [X(C8H8Br1Cl1)]
dipole: -0.4339135 -0.8133695 -0.0312999 debye
dipolederiv: -0.7697745 -0.1027167 0.0477209 -0.118261 -0.1592373 0.0111081 -0.0240826 -0.003717 -0.1690024 -0.4728567 0.32177 -0.0366772 0.4072751 -0.5208895 0.0238544 -0.0453757 0.0219224 -0.0798499 -0.2377593 -0.0699923 0.0643467 -0.0463621 0.0887491 0.015994 -0.0446454 -0.0114891 0.0862924 0.2812246 0.0404281 0.0525499 -0.0189415 0.0922648 0.0131873 0.2111113 0.0505532 -0.076861 -0.3285197 0.1354532 -0.0111375 0.1280825 -0.1403068 0.0386209 0.0027449 0.0356595 -0.1180397 -0.1698801 -0.0857087 0.018658 -0.0775809 -0.0196806 -0.0114688 0.0284481 -0.0030541 -0.1646655 1.0575994 0.1590776 0.0111747 0.1866794 0.13625 0.0030855 -0.058557 -0.0006534 0.1036077 0.651495 -0.5140116 0.0821974 -0.6413371 0.7676458 -0.0227534 0.062949 -0.028315 -0.0239039 0.0767858 -0.0174793 0.044087 0.048312 0.1264615 0.0308561 0.0342762 0.0181728 -0.1114109 -0.1346207 0.1195773 0.0285087 0.1502101 -0.2811413 0.0132612 0.019084 0.0101168 -0.1200611 0.0163852 0.0325353 -0.0497925 0.0560045 -0.0381249 0.0910659 -0.0183564 0.0536151 0.030178 0.043476 0.0050638 -0.0118575 -0.0293381 -0.0327016 -0.1102871 -0.0030457 -0.0655743 0.0081322 0.0919584 -0.0510055 -0.0270845 -0.0528005 -0.0144634 -0.0281151 -0.0229079 -0.0294992 0.1414817 0.0071961 0.1111745 -0.0285818 0.0959817 -0.0045495 0.0019345 -0.0256983 0.0090706 0.1430684 -0.0498128 -0.0702134 -0.044061 -0.0195487 -0.0123492 -0.1000327 -0.0091512 -0.0574286 0.0120417 -0.0766504 0.0554143 -0.0685235 0.0006342 -0.0018856 0.0733233 -0.0271713 0.047816 0.032258 0.0486229 -0.0482122 -0.0248127 -0.0596527 -0.0865399 -0.0342096 -0.0343668 -0.0350016 0.1478933 -0.0348689 -0.0211544 -0.046715 -0.0093567 0.1004984 -0.0094242 -0.0452553 -0.012194 0.158841 unknown
polarizability: 168.0029648|-2.6570019|106.5396469|10.7295285|3.0156255|54.5541489 unknown
InChI: InChI=1S/C8H8BrCl/c9-5-4-7-2-1-3-8(10)6-7/h1-3,6H,4-5H2
charge 0 multiplicity 1
18 atoms
Br 4.579348 0.609516 -0.255988
Cl -3.044907 2.001707 -0.146429
C  1.838082 0.022279 0.692119
C  0.36725 -0.23777 0.380821
C  -0.543554 0.846605 0.291224
C  -0.103138 -1.55346 0.132058
C  2.607158 0.258462 -0.620758
C  -1.887446 0.59433 -0.040177
C  -1.457421 -1.782648 -0.197409
C  -2.369044 -0.705583 -0.288711
H  2.282318 -0.839068 1.221778
H  1.952095 0.907599 1.342387
H  -0.208445 1.871097 0.486357
H  0.591394 -2.398634 0.207287
H  2.592605 -0.620832 -1.282688
H  2.254585 1.149992 -1.161349
H  -1.814097 -2.801701 -0.381739
H  -3.420383 -0.872091 -0.540783
