program: Gaussian 09
title: 000140139
version: EM64L-G09RevD.01
frameworkgroup: C1[X(C9H7NOS)]
method: RPBEPBE
basis: SDD
operation: Freq
keyword: #p
keyword: freq=noraman
keyword: PBEPBE/SDD
title: #p freq=noraman PBEPBE/SDD
converged: NO YES NO NO
title: Mulliken charges:
elementType: S O N C C C C C C C C C H H H H H H H
charge: 0.194905 -0.179438 0.124433 0.446168 0.265474 -0.378704 -0.376702 -0.323262 -0.313506 -0.801599 0.097457 -0.468112 0.238598 0.239512 0.259262 0.269407 0.231213 0.231018 0.243879
chargesum: 0.00000
title: Mulliken charges with hydrogens summed into heavy atoms:
elementType: S O N C C C C C C C C C
charge: 0.194905 -0.179438 0.124433 0.446168 0.265474 -0.140107 -0.137190 -0.064000 -0.044099 -0.095489 0.097457 -0.468112
polarizability: 2.48895588e+02 -1.19283225e+01 1.16880021e+02 -6.68702138e-01 -1.09980885e-01 5.08675405e+01
1716.lowfreq: -27.9030 -10.1007 -8.1836 -0.0024 -0.0014 0.0015 3.5360 41.6500 46.6510
frequency: -27.7500 41.6272 46.6239 91.4793 123.5182 176.6270 272.0555 277.3436 338.0849 398.6924 405.4430 444.1843 445.1964 480.1414 582.7551 627.3194 647.9331 676.2209 741.2547 776.0774 842.2004 847.7509 860.0956 981.6327 988.0739 997.2067 1009.3689 1046.7127 1080.7819 1125.1529 1185.5654 1225.2960 1255.4425 1305.6362 1376.7870 1397.3831 1413.7999 1467.6168 1472.5358 1499.5906 1566.9060 1595.6993 1619.6403 2059.4989 2978.3467 3060.8988 3092.4822 3131.7904 3133.4683 3158.9403 3163.2207
redmass: 1.0211 5.1612 9.6073 6.2317 6.7482 7.4184 4.5772 6.0773 3.4400 8.3451 2.8937 7.9191 8.5517 3.0693 7.1976 7.4620 8.4956 4.5664 2.8845 5.5924 7.8220 1.5632 1.2765 1.3509 1.4046 1.3736 3.0108 1.6028 5.5480 1.3171 1.1478 3.0965 4.5383 1.2853 4.4904 1.2188 3.8509 1.1069 1.0585 2.6689 7.3630 9.3781 6.3159 12.7924 1.0394 1.0939 1.1001 1.0888 1.0891 1.0950 1.0967
irintensity: 0.6378 0.2655 0.3032 0.5462 0.1480 0.7470 3.2157 4.5621 2.3809 7.8473 0.2416 1.0555 0.8474 11.0647 43.9989 8.7536 3.9427 20.8217 24.8160 86.2718 118.6672 30.2430 3.5127 2.7177 0.0445 0.8026 8.1180 27.5670 80.5475 9.0879 133.7266 3.6919 550.4585 1.5836 9.4262 15.6777 9.8322 17.5046 13.9681 18.0971 106.8056 182.5296 123.3733 1618.3034 20.1776 20.1872 14.8599 11.0442 16.3956 11.0764 2.5937
temp: 298.150 k
press: 1.00000 atm
elementType: 16 8 7 6 6 6 6 6 6 6 6 6 1 1 1 1 1 1 1
symmnumber: 1
zpe: 356081.0 jmol-1
zpe.correction: 0.135624 hartree
zpe.thermalcorrener: 0.146151 hartree
zpe.thermalcorrenthalpy: 0.147095 hartree
zpe.thermalcorrgfe: 0.097535 hartree
zpe.sumelectzpe: -874.364578 hartree
zpe.sumelectthermal: -874.354051 hartree
zpe.sumelectthermalent: -874.353107 hartree
zpe.sumelectthermalfe: -874.402667 hartree
dipole: -4.5747 -2.3235 0.0668
dipole: 5.1314
quadrupole: -69.1423 -77.3690 -78.4289
quadrupole: -1.8887 -0.3453 -0.0614
quadrupole: 5.8377 -2.3889 -3.4489 -1.8887 -0.3453 -0.0614
hfenergy: -874.5002021 hartree
pointgroup: C01 [X(C9H7N1O1S1)]
dipole: 1.8892992 0.7112588 0.0213875 debye
dipolederiv: -1.112036 0.4377937 0.0021632 0.5055144 -0.1923663 -0.0010933 0.0032904 -0.0013709 -0.0097266 -0.8964925 -0.2110203 0.001443 0.1349469 -1.0533748 -0.0005037 0.0020421 0.0027778 -0.3105372 -3.0114421 1.1105569 0.0063994 1.2015066 -0.7846915 -0.0014778 0.0090084 -0.0028066 -0.0944716 0.638344 0.1007192 0.0241368 0.1595652 0.096696 0.0051086 0.1044714 0.0150837 -0.0032503 -1.119406 -0.0951335 -0.0031937 -0.1863941 -0.1225803 -0.0003838 0.0043358 0.000907 -0.0328971 -0.5079505 0.0741558 -0.003028 0.2627278 0.1056012 0.0062976 -0.0098262 0.0037318 -0.1680214 -0.3102783 -0.2026817 0.0012698 -0.4585631 -0.050267 -0.0077935 -0.0038915 -0.0066358 -0.1659731 0.2275933 -0.0362495 0.0030795 0.2858062 0.0295806 -0.0042253 -0.009388 -0.0033784 -0.10169 0.3262793 0.1226772 0.0006989 -0.20887 0.0555613 0.0046163 -0.0095877 -0.0005912 -0.0893215 -0.2713608 -0.062118 -0.0219885 -0.0760332 0.060178 -0.0051949 -0.2034727 -0.0304422 0.0470388 3.1468558 -0.3226756 -0.0050863 -0.8415995 1.6438475 0.0005476 -0.0087772 -0.0021721 0.2797515 2.7105049 -0.9788051 -0.0062226 -0.8931082 0.2702092 0.0022449 -0.0091316 0.0034331 -0.0080835 0.0404028 -0.0656685 0.0036137 -0.0863615 -0.0783114 0.0002963 0.0067348 0.0051884 0.1515421 -0.0449443 0.1065667 0.0026611 0.1019719 -0.0023219 0.0021981 0.0078927 -0.0020592 0.1504938 0.0524282 0.0744728 0.0004077 0.1227749 0.0158052 0.000831 0.002557 0.0018155 0.1498732 0.1227872 -0.0684426 0.0009142 -0.0249387 0.0011054 -0.0000227 0.0035983 -0.0000045 0.1532874 -0.0093912 0.0363789 0.0419676 0.1023954 -0.0317246 -0.0899259 0.1085174 -0.0575679 0.0692147 0.0394666 0.0037691 -0.0011408 -0.069117 -0.0751428 0.1004038 0.0767976 0.0914622 0.0675201 -0.0213603 -0.0242955 -0.048095 -0.0322241 0.1121963 -0.0119234 -0.075171 -0.0173707 -0.0847493 unknown
polarizability: 244.7093023|-26.0319173|121.068516|0.2350117|0.0537287|50.8653307 unknown
InChI: InChI=1S/C9H7NOS/c1-7-2-4-8(5-3-7)9(11)10-6-12/h2-5H,1H3
charge 0 multiplicity 1
19 atoms
S  -4.832989 1.426232 0.014007
O  -1.756645 -1.949961 0.009544
N  -2.21081 0.340289 0.005672
C  2.901844 0.234019 -0.01584
C  0.12104 -0.398701 -0.001774
C  1.921216 1.26231 -0.018164
C  2.462135 -1.118644 -0.012061
C  0.547498 0.954917 -0.009522
C  1.092503 -1.435617 -0.003603
C  4.379908 0.570297 0.006446
C  -1.314145 -0.772352 0.004982
C  -3.358677 0.763209 0.009469
H  2.242495 2.310273 -0.027948
H  3.205458 -1.924235 -0.017134
H  -0.200875 1.753975 -0.012315
H  0.750102 -2.475763 -0.001849
H  4.982446 -0.212229 -0.486313
H  4.586153 1.532172 -0.493983
H  4.745344 0.657808 1.048388
