program: Gaussian 09
title: 000140132
version: EM64L-G09RevD.01
frameworkgroup: C1[X(C9H9NS)]
method: RPBEPBE
basis: SDD
operation: Freq
keyword: #pfreq=noraman
keyword: PBEPBE/SDD
title: #p freq=noraman PBEPBE/SDD
converged: NO NO NO NO
title: Mulliken charges:
elementType: S N C C C C C C C C C H H H H H H H H H
charge: 0.104920 0.246790 0.348258 0.320710 -0.550297 -0.397185 -0.400254 -0.814010 -0.238118 -0.225894 -0.523131 0.249222 0.239050 0.232710 0.234856 0.255489 0.221096 0.232416 0.232298 0.231074
chargesum: 0.00000
title: Mulliken charges with hydrogens summed into heavy atoms:
elementType: S N C C C C C C C C C
charge: 0.104920 0.246790 0.348258 0.320710 -0.062025 -0.164476 -0.165398 -0.105010 -0.005819 0.005181 -0.523131
polarizability: 1.63914282e+02 -1.12970226e+01 1.03892420e+02 1.74048678e+00 -4.49690321e+00 8.08112295e+01
1716.lowfreq: -22.8149 -8.3599 -0.0020 -0.0016 -0.0015 1.3204 10.2645 20.8956 59.8536
frequency: -19.3406 10.5690 59.7311 124.3282 135.0675 204.7505 282.4137 304.8587 380.8713 392.0531 395.5366 442.0631 497.9845 530.5587 594.9036 659.0876 725.1470 739.9467 771.7892 831.0598 875.8440 933.7902 953.4496 987.0514 991.7169 1044.3702 1048.6227 1099.3867 1115.5878 1176.3843 1185.2772 1218.3302 1240.7857 1292.2513 1332.9436 1378.9170 1402.2212 1435.1630 1463.4066 1475.1455 1476.9376 1488.1439 1591.1525 1615.3989 2217.9170 2961.9136 2975.0405 3009.6288 3052.8407 3087.7597 3119.7646 3125.9250 3143.0541 3164.0646
redmass: 6.9833 8.3633 2.6671 1.3213 3.8149 3.2892 2.6326 3.9704 5.2065 4.6779 6.9365 2.9965 3.4264 5.2714 5.7255 5.0652 4.1336 1.9159 1.8287 3.8344 1.3435 1.6141 1.4824 1.5985 1.3329 1.6267 2.0641 8.2295 1.9570 1.0713 2.3268 1.4837 1.6747 1.3336 1.3081 5.5284 1.2465 2.1128 1.0873 1.0779 1.3963 1.7291 6.4242 6.3698 12.2169 1.0600 1.0387 1.0996 1.0962 1.0984 1.0870 1.0889 1.0935 1.1007
irintensity: 0.0210 0.0277 3.2132 1.1767 1.5130 3.8364 3.6551 1.4780 0.4034 0.7271 0.6195 4.4434 3.6133 6.4080 13.9633 43.3049 6.1628 43.3360 26.2930 7.8169 1.0167 1.5203 0.4431 1.4946 0.0211 8.8251 8.8176 0.7876 3.4256 0.2084 4.3303 5.9307 0.7703 0.6866 71.5317 1.8545 10.9460 4.5090 30.0573 28.2263 17.1777 5.3118 0.4121 2.5873 1001.7194 45.8580 24.8854 13.4239 14.9642 20.3206 9.9081 2.9501 28.3611 26.9609
temp: 298.150 k
press: 1.00000 atm
elementType: 16 7 6 6 6 6 6 6 6 6 6 1 1 1 1 1 1 1 1 1
symmnumber: 1
zpe: 405312.2 jmol-1
zpe.correction: 0.154375 hartree
zpe.thermalcorrener: 0.164495 hartree
zpe.thermalcorrenthalpy: 0.165439 hartree
zpe.thermalcorrgfe: 0.116183 hartree
zpe.sumelectzpe: -800.381305 hartree
zpe.sumelectthermal: -800.371185 hartree
zpe.sumelectthermalent: -800.370241 hartree
zpe.sumelectthermalfe: -800.419497 hartree
dipole: 3.8567 -0.0705 1.9220
dipole: 4.3097
quadrupole: -82.5637 -65.1907 -71.1308
quadrupole: -0.3650 -6.6696 -1.4136
quadrupole: -9.6020 7.7710 1.8309 -0.3650 -6.6696 -1.4136
hfenergy: -800.5356798 hartree
pointgroup: C01 [X(C9H9N1S1)]
dipole: -1.3875875 0.0452556 0.9733872 debye
dipolederiv: -0.7652759 0.0800654 0.3880076 0.1358637 -0.1302857 -0.0813048 0.5710707 -0.0686243 -0.4461729 -1.6969166 0.1757982 0.8123224 0.2179714 -0.1945658 -0.1559102 1.104588 -0.1549907 -0.9169366 0.0770114 0.0072356 0.0642423 0.0646213 -0.1021149 -0.0043989 0.0892084 -0.0270669 -0.1690961 0.0294893 -0.2063348 0.0033367 -0.102159 0.2360946 -0.0310458 -0.0194843 -0.0368345 -0.0203423 1.005191 -0.0423239 -0.2776342 -0.0451982 0.3121589 0.0586957 -0.4151304 0.0498943 0.575173 -0.0784662 0.0583718 0.0774576 -0.0427805 0.0389622 0.0530709 0.048168 0.0520792 -0.1045309 -0.0987534 0.1577377 0.049284 0.0631251 -0.0197482 0.068741 0.0334069 0.1078171 -0.1238213 -0.0371878 0.1475624 0.0081136 0.0566267 -0.0672998 0.0216947 -0.0028924 0.0222195 0.0619342 -0.0862025 -0.0983511 0.0286564 -0.0846261 0.0303301 0.0008686 0.0089127 -0.0060254 -0.1403273 0.0635548 -0.0111221 0.1075905 0.0127456 -0.0043297 0.017338 0.1001006 0.0216899 -0.087442 1.6137384 -0.2317634 -1.0943082 -0.3218573 0.0115204 0.2154864 -1.4306775 0.1971214 0.9228132 -0.0274651 0.0054297 0.0651945 -0.0001508 -0.0669212 -0.1567168 0.0931599 -0.0552439 0.0081661 -0.0835064 0.033618 0.0409911 0.0380113 0.005279 0.1535141 0.100128 0.0574123 -0.0540145 0.0615283 -0.089543 -0.0724222 -0.0697535 -0.0460655 -0.0541548 -0.0495113 -0.0769121 0.1042054 0.0543265 -0.0447379 -0.0422625 -0.0830888 -0.07076 -0.0690407 -0.0560388 -0.0630553 0.1175976 -0.0440321 0.0495192 0.088267 0.0441578 0.0535838 0.0117827 0.1159211 -0.010473 0.0414793 0.0857987 0.0439261 -0.0711072 0.0578694 0.036863 -0.0037913 -0.0853741 0.079015 -0.1102151 -0.0120893 -0.1465036 -0.0464961 -0.0580154 -0.0435805 -0.0326721 -0.0540281 -0.078033 0.0832172 0.0290019 0.0944501 -0.0295786 0.108734 -0.0665325 -0.0030343 -0.0431861 -0.0033027 0.1481007 -0.0897449 0.0169657 -0.0996546 0.0079033 0.087412 -0.0091224 -0.1083413 -0.0066868 0.1102123 unknown
polarizability: 158.6722289|-14.998351|104.3727487|-14.5053664|10.7177472|85.5729543 unknown
InChI: InChI=1S/C9H9NS/c1-8-4-2-3-5-9(8)6-10-7-11/h2-5H,6H2,1H3
charge 0 multiplicity 1
20 atoms
S  4.180469 -0.344253 -1.565497
N  2.05374 0.074152 0.270024
C  -0.405162 0.266815 0.557232
C  -0.980445 -0.944422 0.068356
C  0.98507 0.277561 1.201209
C  -1.123315 1.48213 0.461773
C  -2.274224 -0.888755 -0.507694
C  -0.24369 -2.270256 0.156595
C  -2.413385 1.520222 -0.112915
C  -2.989191 0.327047 -0.601273
C  2.95221 -0.096943 -0.511945
H  1.138421 1.245801 1.717146
H  1.047363 -0.505079 1.985578
H  -0.669698 2.408237 0.83582
H  -2.727199 -1.812216 -0.887333
H  0.68494 -2.263678 -0.443467
H  0.045635 -2.511124 1.197929
H  -0.874672 -3.096366 -0.211916
H  -2.958946 2.467636 -0.178452
H  -3.98792 0.34129 -1.05167
