program: Gaussian 09
title: 000140128
version: EM64L-G09RevD.01
frameworkgroup: C1[X(C5H12OSi)]
method: RPBEPBE
basis: SDD
operation: Freq
keyword: #p
keyword: freq=noraman
keyword: PBEPBE/SDD
title: #p freq=noraman PBEPBE/SDD
converged: YES YES NO NO
title: Mulliken charges:
elementType: Si O C C C C C H H H H H H H H H H H H
charge: 1.299856 -0.302916 -0.413461 -0.336833 -1.016745 -1.038188 -1.016553 0.230467 0.219586 0.220468 0.236203 0.234659 0.237750 0.238203 0.259055 0.229918 0.232031 0.233215 0.253285
chargesum: 0.00000
title: Mulliken charges with hydrogens summed into heavy atoms:
elementType: Si O C C C C C
charge: 1.299856 -0.302916 -0.182993 0.103220 -0.308133 -0.311012 -0.298023
polarizability: 8.62139046e+01 3.00388097e+00 7.68212652e+01 -3.34035365e+00 -7.76705000e-01 7.52229919e+01
1716.lowfreq: -8.4797 -0.0029 -0.0029 -0.0005 4.1430 8.8272 47.8802 117.0724 122.4536
frequency: 47.4555 117.0531 122.4411 136.0287 144.2065 149.9341 185.8569 194.7050 212.5422 324.0507 336.8845 554.3836 636.1265 694.3338 700.8058 718.2106 744.7669 802.9006 807.7994 826.5938 899.9016 907.0039 920.3628 950.2820 1008.4798 1107.7583 1113.8687 1210.9452 1288.9918 1294.4312 1295.6745 1308.6673 1441.7077 1447.0718 1449.5030 1454.5629 1455.4544 1463.9870 1480.3698 2979.8116 2982.0921 2982.9892 3047.8623 3057.1552 3081.3798 3083.4322 3084.9972 3085.8570 3089.1987 3091.3052 3157.8415
redmass: 3.4777 1.2597 1.7906 1.4249 1.0516 1.7233 2.5857 2.4481 2.5312 4.8731 3.2229 3.3467 3.5581 3.3730 3.1306 6.2419 1.1705 1.6749 1.3516 3.2071 1.4321 1.4928 1.4690 1.3769 1.1116 1.2921 1.2688 1.7757 1.9020 1.2046 1.2333 1.2267 1.0536 1.0541 1.0556 1.0490 1.0484 1.0527 1.1269 1.0342 1.0342 1.0342 1.0796 1.0604 1.0982 1.0985 1.0979 1.0980 1.0986 1.0982 1.1187
irintensity: 3.8843 1.6109 2.9159 0.4764 0.0524 0.0647 0.2179 1.2004 2.9544 14.5467 4.2369 0.9645 9.8975 7.2905 8.9809 13.8248 0.0964 28.8863 14.3401 8.5708 61.4784 85.6693 149.5128 37.6122 5.8902 7.1575 11.3803 4.8877 2.0787 48.3642 50.9416 11.2421 0.0418 0.3556 0.1157 11.4887 11.4393 17.6616 0.8348 16.0879 18.2282 7.4079 23.7282 32.6786 7.0718 2.7077 30.4333 34.4211 4.1588 21.3692 34.2190
temp: 298.150 k
press: 1.00000 atm
elementType: 14 8 6 6 6 6 6 1 1 1 1 1 1 1 1 1 1 1 1
symmnumber: 1
zpe: 410797.8 jmol-1
zpe.correction: 0.156465 hartree
zpe.thermalcorrener: 0.167327 hartree
zpe.thermalcorrenthalpy: 0.168271 hartree
zpe.thermalcorrgfe: 0.120425 hartree
zpe.sumelectzpe: -561.727267 hartree
zpe.sumelectthermal: -561.716405 hartree
zpe.sumelectthermalent: -561.715460 hartree
zpe.sumelectthermalfe: -561.763306 hartree
dipole: 1.2217 -1.9127 -0.5605
dipole: 2.3378
quadrupole: -53.3536 -53.4861 -50.2920
quadrupole: 5.5478 1.4571 -0.5360
quadrupole: -0.9764 -1.1089 2.0853 5.5478 1.4571 -0.5360
hfenergy: -561.8837315 hartree
pointgroup: C01 [X(C5H12O1Si1)]
dipole: -0.3430955 -0.8141653 -0.2556533 debye
dipolederiv: 1.3792804 0.0355866 -0.069931 -0.0079245 1.2288156 0.0153542 0.0630703 0.0377613 1.1632465 -0.4500674 -0.1589721 -0.0981215 -0.1182655 -0.5893163 -0.0645538 -0.1244786 -0.0920573 -0.3187916 -0.1114899 0.0173332 0.1097675 0.0818181 -0.0838823 -0.0443897 0.174389 -0.0077629 -0.045087 0.156692 -0.0052157 0.1117616 -0.1230329 0.170652 0.0239317 -0.0177262 -0.0115177 0.2806075 -0.366606 -0.0745448 0.0074649 -0.0563746 -0.4353691 -0.0064459 -0.0265106 -0.0152279 -0.2777837 -0.3289587 -0.0352286 0.0075227 -0.0037197 -0.3317621 0.0703329 -0.005165 0.0681773 -0.4345302 -0.368135 0.0325045 0.0709383 0.0569967 -0.3606589 -0.0659521 0.032386 -0.0745512 -0.3395632 -0.0106227 0.0005753 -0.0680757 -0.0212263 0.0516092 0.0920046 -0.0558609 0.1082861 -0.1154895 -0.1216942 0.1152211 -0.0404354 0.1163595 0.0420132 -0.0007502 -0.0547422 0.021439 0.0304522 0.0941166 0.0257961 -0.0218324 0.0526173 0.0657402 -0.0144805 0.028752 -0.0286155 -0.1443354 0.0598313 0.0775227 0.0606787 0.0941925 -0.0312148 -0.1047126 0.0664693 -0.0975097 0.0241766 0.1063144 -0.015869 0.0300359 -0.0149165 0.0282484 0.1195933 0.0314191 0.1111122 -0.0824898 -0.1288027 -0.018186 -0.0877517 -0.0503548 0.0990478 -0.0102201 -0.0892867 -0.0068476 0.0715405 -0.0681137 0.0699042 -0.0967039 0.077042 0.0870134 0.0343749 -0.1186716 0.0340147 0.0568947 0.0453852 -0.1079915 0.030527 -0.1075039 -0.0433317 0.0061232 0.0407608 0.0236059 0.1141187 0.0569589 0.0654506 0.0869776 0.050251 0.0235271 -0.0952743 0.0853156 -0.113045 -0.0350611 -0.1400083 0.0470515 -0.0684323 0.0699418 0.0979846 0.0138498 -0.0524872 0.0141343 0.0793645 0.0997896 -0.0107169 0.050074 -0.0153076 0.0818316 0.0643361 0.0421954 0.0736112 -0.1292804 0.0961303 -0.0602213 -0.0144643 -0.0805927 -0.100948 -0.0331216 -0.0198283 -0.0450073 0.1020104 unknown
polarizability: 86.7674171|0.9358304|75.6679558|-3.807396|0.4172043|75.8227888 unknown
InChI: InChI=1S/C5H12OSi/c1-7(2,3)5-4-6-5/h5H,4H2,1-3H3
charge 0 multiplicity 1
19 atoms
Si -0.83351 -0.133579 -0.017748
O  1.780814 0.976431 0.63986
C  0.909302 -0.286378 0.76002
C  2.17786 -0.294792 -0.051451
C  -1.612809 -1.881544 -0.10912
C  -0.646274 0.627799 -1.760282
C  -1.877701 1.005599 1.107274
H  0.988787 -0.73432 1.764594
H  3.072901 -0.780967 0.358326
H  2.120858 -0.25964 -1.147246
H  -1.009096 -2.556647 -0.743083
H  -1.695978 -2.339224 0.89419
H  -2.62994 -1.831989 -0.54049
H  -1.627969 0.941168 -2.160149
H  0.004859 1.519973 -1.714583
H  -0.204361 -0.088972 -2.476613
H  -2.887067 1.164331 0.684888
H  -1.996923 0.573085 2.117774
H  -1.390452 1.991567 1.214639
