program: Gaussian 09
title: 000140124
version: EM64L-G09RevD.01
frameworkgroup: C1[X(C2H4N4)]
method: RPBEPBE
basis: SDD
operation: Freq
keyword: #p
keyword: freq=noraman
keyword: PBEPBE/SDD
title: #p freq=noraman PBEPBE/SDD
converged: YES YES NO NO
title: Mulliken charges:
elementType: N N N N C C H H H H
charge: -0.081049 -0.040890 -0.033278 -0.107567 -0.569935 -0.220150 0.257791 0.257791 0.261040 0.276248
chargesum: 0.00000
title: Mulliken charges with hydrogens summed into heavy atoms:
elementType: N N N N C C
charge: -0.081049 -0.040890 -0.033278 -0.107567 0.206686 0.056098
polarizability: 6.06380837e+01 7.28818192e-01 4.73412091e+01 8.93631955e-03 8.68802865e-05 2.54057435e+01
1716.lowfreq: -10.5382 -4.7436 0.0009 0.0010 0.0010 3.5456 88.5005 228.1034 345.9477
frequency: 88.4786 228.1024 345.9476 647.2165 671.7256 681.5820 825.6048 882.3205 947.3856 961.7199 1081.9687 1118.3025 1123.9263 1200.4512 1223.3442 1341.4430 1352.7912 1430.1149 1460.7665 1478.2231 3019.8768 3115.9963 3147.3461 3276.0099
redmass: 1.1055 3.3081 3.1327 8.1257 5.0996 4.7490 1.3771 4.4338 6.2531 5.7502 2.8485 7.3896 1.3251 1.9612 3.4608 6.9851 3.1468 1.1836 1.0419 1.0475 1.0333 1.1028 1.1019 1.1005
irintensity: 0.0001 8.2944 5.4991 1.9455 5.6605 7.6281 26.3546 22.6401 9.2382 7.7743 10.5649 5.4211 0.9858 8.0361 11.2409 10.3205 3.4160 8.5525 21.5865 16.0876 17.3324 11.8609 1.9918 0.0757
temp: 298.150 k
press: 1.00000 atm
elementType: 7 7 7 7 6 6 1 1 1 1
symmnumber: 1
zpe: 189312.9 jmol-1
zpe.correction: 0.072105 hartree
zpe.thermalcorrener: 0.077317 hartree
zpe.thermalcorrenthalpy: 0.078261 hartree
zpe.thermalcorrgfe: 0.043299 hartree
zpe.sumelectzpe: -297.103171 hartree
zpe.sumelectthermal: -297.097959 hartree
zpe.sumelectthermalent: -297.097015 hartree
zpe.sumelectthermalfe: -297.131978 hartree
dipole: 2.6629 -1.6745 0.0001
dipole: 3.1457
quadrupole: -28.4246 -41.2613 -34.6343
quadrupole: 4.7157 -0.0001 0.0000
quadrupole: 6.3488 -6.4879 0.1391 4.7157 -0.0001 0.0000
hfenergy: -297.175276 hartree
pointgroup: C01 [X(C2H4N4)]
dipole: 1.0755151 -0.5842064 0.1834049 debye
dipolederiv: -0.4044536 0.1080537 -0.0394794 0.0114096 0.0643731 -0.0311065 -0.0139556 -0.0275359 -0.0568886 -0.1035443 -0.0235667 0.0062204 0.2178777 -0.3160077 0.0588317 -0.0538083 0.0502063 -0.1238625 0.3019062 -0.1935805 0.0633608 -0.2128617 -0.1388009 -0.0039851 0.0678436 -0.0034358 -0.1203905 -0.4668759 0.0515779 -0.023942 -0.2327426 -0.1029211 -0.0231695 0.0463972 -0.0125659 -0.1569257 0.4110649 -0.0216987 0.0132672 0.0634485 0.1048941 0.0293995 -0.0089517 0.0263561 0.2077438 0.1050718 0.095091 -0.0177719 0.1819575 0.1519961 -0.0441154 -0.0392183 -0.0475461 -0.0443144 0.0039235 0.0002704 -0.0142763 0.0209305 0.120323 0.0547194 -0.077895 0.0344852 -0.0569898 -0.0014012 0.0121816 0.012591 0.0619306 0.0445217 -0.1044362 0.0584585 -0.0865552 0.0256024 0.0821823 0.0148432 -0.0060909 -0.0643683 -0.0183286 0.0391599 0.0138819 0.0417615 0.1348107 0.0721263 -0.0431719 0.006121 -0.0475817 0.0899503 0.0247022 0.0072477 0.0248298 0.1912147 unknown
polarizability: 60.5014332|1.5821741|46.1931882|0.8973448|-5.0720942|26.6904149 unknown
InChI: InChI=1S/C2H4N4/c1-6-4-2-3-5-6/h2H,1H3
charge 0 multiplicity 1
10 atoms
N  0.672407 -0.002428 -0.021999
N  -0.044791 -1.144017 0.233861
N  -0.124029 1.1053 -0.324222
N  -1.402828 0.647754 -0.257623
C  2.133551 0.058333 0.016665
C  -1.327294 -0.698731 0.077335
H  2.495393 -0.203714 1.023665
H  2.559346 -0.64426 -0.717215
H  2.428749 1.087452 -0.232757
H  -2.196104 -1.336789 0.20319
