program: Gaussian 09
title: 000140100
version: EM64L-G09RevD.01
frameworkgroup: C1[X(C12H9N)]
method: RPBEPBE
basis: SDD
operation: Freq
keyword: #pfreq=noraman
keyword: PBEPBE/SDD
title: #p freq=noraman PBEPBE/SDD
converged: YES YES NO NO
title: Mulliken charges:
elementType: N C C C C C C C C C C C C H H H H H H H H H
charge: -0.029153 -0.415063 -0.411551 -0.482726 0.380975 0.373629 -0.203353 -0.204939 -0.599393 -0.456385 0.406535 -0.378489 -0.270423 0.263850 0.263614 0.242381 0.245601 0.248660 0.248006 0.270393 0.251866 0.255966
chargesum: 0.00000
title: Mulliken charges with hydrogens summed into heavy atoms:
elementType: N C C C C C C C C C C C C
charge: -0.029153 -0.151213 -0.147937 0.005256 0.380975 0.373629 0.045307 0.043067 -0.328999 -0.204519 0.406535 -0.122523 -0.270423
polarizability: 1.83290346e+02 7.40479081e+00 1.19682464e+02 -2.45966557e-01 1.29448846e+00 7.50271795e+01
1716.lowfreq: -11.7113 0.0003 0.0004 0.0007 9.6451 15.0863 79.0138 133.0344 156.8671
frequency: 78.9762 133.0285 156.8621 210.7010 332.4510 347.1112 378.0696 438.4368 471.8061 496.5440 529.7948 550.1562 587.2707 638.5867 687.1231 711.3598 739.4678 756.1615 809.9793 831.4426 853.5759 877.0715 882.8168 904.6182 914.6439 922.9648 941.3862 960.1881 967.1548 1013.7829 1053.3596 1076.2775 1119.0666 1123.8327 1143.2881 1175.7760 1202.5176 1215.9854 1224.0001 1228.4512 1256.6412 1289.1558 1298.8106 1367.7689 1433.8281 1456.8235 1472.6629 1577.1290 1586.3469 1619.4993 2173.6156 3019.9998 3100.3105 3100.9191 3106.5881 3139.3231 3151.3806 3164.6682 3172.4658 3204.8443
redmass: 5.9401 8.3477 4.1390 4.9563 4.2749 4.6579 3.5927 3.8228 3.4400 4.1763 2.7364 4.9587 4.1283 4.0976 4.3033 2.8386 2.8041 4.9945 3.7031 2.6596 1.6116 2.3143 2.1397 2.6079 1.4749 2.1555 3.2812 1.8284 1.4209 1.4348 2.2753 1.2152 1.2678 1.5601 1.4667 2.0608 1.7382 2.9725 1.5713 1.4617 1.3892 1.3761 1.5007 4.9176 4.6413 2.4336 1.1533 5.8226 7.1395 7.4065 12.6320 1.0592 1.1062 1.0899 1.0934 1.0891 1.0932 1.0967 1.0875 1.1105
irintensity: 0.5687 3.1454 2.9450 1.1603 1.3135 1.0325 0.5276 0.7498 2.5624 0.9313 5.8196 1.3520 4.7482 6.2434 6.4802 41.8759 31.2328 1.6448 6.5846 22.7546 30.4366 3.2923 5.6435 7.3658 7.8735 6.1497 4.9716 0.2943 0.4308 9.8271 1.9629 0.5495 0.5757 3.1211 0.7134 2.2491 8.7721 4.0662 8.5935 0.3501 0.0113 1.8236 21.6977 0.0777 9.0994 17.8929 16.6213 1.9444 0.6303 5.4847 56.1138 39.4675 32.0781 40.5660 16.2130 7.0817 3.7738 7.7331 3.4015 16.5054
temp: 298.150 k
press: 1.00000 atm
elementType: 7 6 6 6 6 6 6 6 6 6 6 6 6 1 1 1 1 1 1 1 1 1
symmnumber: 1
zpe: 450865.8 jmol-1
zpe.correction: 0.171726 hartree
zpe.thermalcorrener: 0.181045 hartree
zpe.thermalcorrenthalpy: 0.181989 hartree
zpe.thermalcorrgfe: 0.137016 hartree
zpe.sumelectzpe: -516.491983 hartree
zpe.sumelectthermal: -516.482664 hartree
zpe.sumelectthermalent: -516.481720 hartree
zpe.sumelectthermalfe: -516.526693 hartree
dipole: 5.5021 1.1926 -0.2976
dipole: 5.6378
quadrupole: -97.2828 -66.4625 -75.2151
quadrupole: -5.2862 0.8993 0.6849
quadrupole: -17.6294 13.1910 4.4384 -5.2862 0.8993 0.6849
hfenergy: -516.6637091 hartree
pointgroup: C01 [X(C12H9N1)]
dipole: 2.1671023 0.4526338 -0.1364107 debye
dipolederiv: -0.5575549 -0.0652393 0.0106002 -0.1016297 -0.2512757 0.0052208 0.0160544 0.0056224 -0.2535134 -0.0434648 -0.010295 -0.0292636 -0.0392556 0.2009814 0.0881676 -0.063504 0.0984417 -0.0102624 0.0168527 0.1273798 -0.0496109 0.1675856 0.1626309 -0.0405804 -0.1068323 -0.0397788 -0.0362748 0.0603943 -0.0582238 0.0285866 -0.0574971 -0.0942327 -0.0226399 0.0089295 -0.0233591 0.1627119 0.0827982 -0.154657 -0.0258896 -0.4815972 -0.0645863 -0.0197408 0.001282 -0.0500748 -0.0756297 0.4036313 -0.068485 -0.0095179 0.1844246 -0.1191203 0.0277597 0.077615 0.0472202 -0.0590268 -0.2080435 0.1000435 0.1553784 0.1550694 -0.0839102 0.007791 0.166018 -0.1042223 0.0354935 -0.3093866 -0.0327282 0.1220623 -0.0804671 0.008867 -0.0853086 0.2027933 0.0121682 0.038901 0.0337179 0.1106981 -0.0018737 -0.016865 0.0610035 0.0299251 -0.0411478 0.0111804 -0.1467386 -0.2456173 0.0765147 0.0053194 0.0700943 0.1478956 0.0125998 -0.0063789 0.0240017 -0.1458269 -0.1872397 -0.0877849 0.0012142 -0.0941871 0.1081562 0.0127836 0.0245466 0.0106948 0.1159747 0.0473388 -0.042123 -0.0289756 0.101086 0.0126732 0.005968 -0.0004914 0.010862 -0.1405241 0.5620428 0.1530149 -0.0203959 0.2173457 -0.0150402 -0.0147731 -0.0264682 -0.0172606 0.0178525 0.034516 -0.0334544 -0.0120696 0.0139717 -0.1165607 -0.0620976 0.0070447 -0.0674888 0.0482572 0.0059966 -0.0464485 0.0121692 -0.0855792 -0.1124376 0.0370662 0.0290801 0.0382313 0.0619779 0.0632346 0.016662 -0.1177609 0.0070721 0.0798491 0.0448478 -0.0823057 0.0329934 -0.1355251 -0.179 0.0516796 0.0793643 0.0697802 0.0681627 -0.0198054 0.0327073 -0.0049948 0.071302 0.1548349 -0.0141893 -0.0555932 0.0087145 0.0289437 0.0932747 -0.1079019 0.1038601 0.0055257 0.1296113 -0.0238031 -0.0939145 -0.0350837 0.0633856 -0.0501193 -0.1489184 -0.041472 -0.0150509 0.0814273 -0.026466 0.0053269 -0.036743 -0.0393788 -0.0160782 -0.0030159 -0.0153897 0.1509896 0.0628324 -0.0601293 0.004408 -0.0387218 -0.0769509 -0.0161706 0.0002874 -0.0135607 0.1482717 -0.0089221 0.0880344 0.0204361 0.0724825 0.0309447 -0.0180904 0.0206062 -0.0176747 0.161115 unknown
polarizability: 183.3935881|6.8782433|119.4787181|-1.5453276|2.1814472|75.1276831 unknown
InChI: InChI=1S/C12H9N/c13-7-8-1-4-11-9-2-3-10(6-9)12(11)5-8/h1-5,9-10H,6H2
charge 0 multiplicity 1
22 atoms
N  -4.507056 -0.702494 0.16765
C  1.696905 -1.30543 -0.396637
C  2.245452 0.915613 -0.241693
C  2.465932 -0.250381 -1.279721
C  0.365335 -0.5412 -0.23232
C  0.707527 0.84157 -0.135115
C  2.46949 -1.109357 0.935042
C  2.794389 0.210605 1.027857
C  -0.961736 -0.964509 -0.154252
C  -0.280691 1.818794 0.042114
C  -1.978643 0.029803 0.024051
C  -1.635755 1.405564 0.120656
C  -3.360017 -0.366847 0.105224
H  1.624133 -2.335178 -0.772586
H  2.67028 1.901313 -0.47614
H  1.985636 -0.064012 -2.256791
H  3.531544 -0.503392 -1.41031
H  2.634989 -1.896675 1.673531
H  3.280368 0.727675 1.858034
H  -1.240815 -2.020244 -0.22989
H  -0.026984 2.881641 0.114432
H  -2.432384 2.14414 0.255464
