program: Gaussian 09
title: 000140088
version: EM64L-G09RevD.01
frameworkgroup: C1[X(C6Cl5I)]
method: RPBEPBE
basis: SDD
operation: Freq
keyword: #pfreq=noraman
keyword: PBEPBE/SDD
title: #p freq=noraman PBEPBE/SDD
converged: NO NO NO NO
title: Mulliken charges:
elementType: I Cl Cl Cl Cl Cl C C C C C C
charge: 0.239306 0.059219 0.059212 0.066677 0.066699 0.066679 -0.358439 -0.029687 -0.029629 -0.045458 -0.045460 -0.049118
chargesum: 0.00000
title: Mulliken charges with hydrogens summed into heavy atoms:
polarizability: 2.00234895e+02 7.19555506e-04 1.66644176e+02 -4.69957228e-04 1.54235057e-04 4.20956370e+01
1716.lowfreq: -6.4844 -4.2409 -0.0013 0.0011 0.0017 7.9114 46.0955 60.3905 80.4872
frequency: 46.0940 60.3901 80.4864 133.9385 152.0626 169.5806 207.9528 214.0707 224.3958 233.5765 307.9332 311.3173 323.0586 328.8847 358.6176 575.3345 579.7053 588.9065 591.0743 635.5940 741.1423 795.9787 817.8689 1013.9025 1172.2024 1297.4611 1298.4945 1316.0835 1505.6343 1507.6901
redmass: 37.4324 34.2409 34.6467 37.3277 14.3480 53.8377 32.1479 34.4404 34.5162 29.3272 28.8841 12.4351 12.5102 30.7646 32.8490 12.6034 12.0657 15.0518 12.0880 15.4149 12.0201 12.8534 12.9547 12.1893 12.2627 12.0598 12.0551 12.0017 12.0013 12.0010
irintensity: 0.0436 0.0000 0.0101 0.5078 0.6401 0.0017 0.0145 0.0051 0.0010 0.0884 0.0007 0.2552 0.0000 0.0032 0.0043 0.4971 0.4317 52.3708 0.0000 61.8472 0.5226 1.0224 0.0118 1.4654 0.1625 225.5855 178.2463 3.2093 0.2396 0.3899
temp: 298.150 k
press: 1.00000 atm
elementType: 53 17 17 17 17 17 6 6 6 6 6 6
symmnumber: 1
zpe: 105208.2 jmol-1
zpe.correction: 0.040072 hartree
zpe.thermalcorrener: 0.052486 hartree
zpe.thermalcorrenthalpy: 0.053430 hartree
zpe.thermalcorrgfe: -0.001989 hartree
zpe.sumelectzpe: -2539.554280 hartree
zpe.sumelectthermal: -2539.541866 hartree
zpe.sumelectthermalent: -2539.540922 hartree
zpe.sumelectthermalfe: -2539.596341 hartree
dipole: 0.7919 -0.0001 0.0000
dipole: 0.7919
quadrupole: -112.7751 -117.8896 -117.6982
quadrupole: 0.0005 -0.0001 -0.0001
quadrupole: 3.3459 -1.7687 -1.5772 0.0005 -0.0001 -0.0001
hfenergy: -2539.5943519 hartree
pointgroup: C01 [X(C6Cl5I1)]
dipole: 0.3115515 -0.0000967 -0.0000047 debye
dipolederiv: -0.3573126 0.0000774 0.0000042 0.0000703 0.1728309 -0.0000006 0.0000099 -0.0000024 0.1075009 -0.139468 0.2581863 0.0000034 0.2458829 -0.5371709 -0.0000087 -0.0000009 0.0000057 0.015472 -0.1396387 -0.2583111 -0.0000062 -0.2459906 -0.5369895 -0.0000125 -0.000001 -0.0000049 0.0154682 -0.2022695 0.2921202 -0.0000045 0.3176006 -0.5009636 0.0000079 -0.0000116 0.0000078 0.0202608 -0.2024748 -0.2922307 0.0000107 -0.3177125 -0.5007531 0.0000169 0.0000146 0.0000183 0.0202728 -0.7023736 0.0000911 -0.0000076 0.0000843 -0.0057246 0. -0.0000098 0.0000013 0.0193476 0.8911721 -0.0001984 -0.0000165 -0.0002066 -0.4360004 -0.0000076 -0.0000271 0.0000023 -0.1411764 -0.1259796 -0.5581011 0.0000041 -0.3821123 0.6819678 0.0000267 0.0000145 0.0000003 0.0058994 -0.1256809 0.5583314 0.0000147 0.3823656 0.6816263 0.0000324 0.0000086 0.0000133 0.0058972 0.0774807 -0.5458402 0.0000068 -0.5056977 0.6034949 -0.0000287 0.0000095 -0.0000175 -0.0304065 0.0778097 0.5460246 -0.0000254 0.5058958 0.6031406 -0.0000424 -0.0000296 -0.0000336 -0.0304224 0.948735 -0.0001496 0.0000164 -0.0001798 -0.2254584 0.0000165 0.0000229 0.0000094 -0.0081135 unknown
polarizability: 200.2348942|-0.0035188|166.6441767|-0.0004699|0.0001543|42.095637 unknown
InChI: InChI=1S/C6Cl5I/c7-1-2(8)4(10)6(12)5(11)3(1)9
charge 0 multiplicity 1
12 atoms
I  3.538931 -0.000513 -0.000018
Cl 1.545831 -2.800919 -0.000047
Cl 1.546773 2.800429 0.000079
Cl -1.634403 2.777494 -0.000035
Cl -1.635325 -2.77691 0.000088
Cl -3.234905 0.000459 -0.00002
C  1.405171 -0.000205 0.000008
C  0.685997 -1.224436 -0.000028
C  0.686394 1.224224 0.000045
C  -0.73176 1.22514 0.000002
C  -0.732152 -1.224901 0.000021
C  -1.440552 0.000238 0.000004
