program: Gaussian 09
title: 000140077
version: EM64L-G09RevD.01
frameworkgroup: C1[X(C9H13N2O2P)]
method: RPBEPBE
basis: SDD
operation: Freq
keyword: #p
keyword: freq=noraman
keyword: PBEPBE/SDD
title: #p freq=noraman PBEPBE/SDD
converged: YES YES NO NO
title: Mulliken charges:
elementType: P O O N N C C C C C C C C C H H H H H H H H H H H H H
charge: 1.370013 -0.515421 -0.605196 -0.728460 -0.726141 -0.311077 -0.352222 -0.350346 0.350262 -0.346128 -0.379422 -0.207938 -0.195973 -0.254555 0.198806 0.230567 0.228847 0.223501 0.223479 0.228835 0.351539 0.346485 0.297653 0.244833 0.226188 0.225251 0.226621
chargesum: 0.00000
title: Mulliken charges with hydrogens summed into heavy atoms:
elementType: P O O N N C C C C C C C C C
charge: 1.370013 -0.515421 -0.605196 -0.376922 -0.379655 0.118297 0.100125 0.101968 0.350262 -0.048475 -0.134589 0.018249 0.029278 -0.027935
polarizability: 1.75268738e+02 5.31976572e-01 1.31102080e+02 1.33021931e+01 8.79621896e+00 9.46372643e+01
1716.lowfreq: -13.2785 -7.6866 -0.0019 -0.0016 0.0020 6.0165 26.4481 34.1964 61.0119
frequency: 26.3181 33.9206 60.9785 109.5706 131.4411 194.9202 208.4893 238.7580 263.3914 301.2761 317.1613 329.3496 385.2360 399.3181 410.9899 437.6575 467.8522 496.2860 539.7667 567.8850 605.0391 634.1606 695.6211 711.0099 763.2297 811.7990 817.2699 838.9769 840.6534 885.3114 913.6744 947.9571 970.3887 984.4318 988.7019 992.4689 1021.2764 1045.7204 1076.6187 1099.6329 1117.8964 1124.2586 1163.5326 1172.3728 1193.4455 1199.4709 1210.9300 1272.3912 1310.6700 1332.6929 1339.3605 1344.5170 1378.8102 1387.6466 1417.1264 1440.5104 1444.2205 1470.8116 1472.0310 1481.9957 1589.7822 1603.7093 2947.3105 2952.3401 3002.6202 3046.5352 3053.6225 3076.0569 3125.7724 3134.4263 3148.2488 3158.0513 3169.1691 3570.4062 3593.4507
redmass: 4.7339 3.8818 3.7108 4.1855 3.7436 1.8505 4.3771 6.8767 3.9843 1.9274 2.2430 3.6293 1.8665 5.6121 2.9740 5.7092 2.6436 3.3240 5.6435 2.2749 6.1308 6.6774 2.2497 5.3460 1.5623 5.2987 5.1612 2.4960 1.2531 1.4334 1.4137 2.5794 1.3542 5.7437 1.3793 2.1484 2.1110 8.8254 1.5585 2.0683 2.7664 3.5228 1.2468 1.3094 1.9343 1.1591 1.1873 1.1694 1.3383 1.1470 1.2834 1.3652 7.7931 1.4086 1.3375 2.3172 1.0996 1.0815 2.1876 1.0817 6.4508 6.2029 1.0678 1.0680 1.0613 1.0951 1.0949 1.1035 1.0846 1.0890 1.0936 1.0963 1.1007 1.0764 1.0773
irintensity: 1.9879 0.8275 1.9919 1.5686 0.4034 1.6870 1.8909 2.7387 6.8337 41.0436 23.1485 19.8364 24.5219 17.4180 0.1520 47.4585 162.8705 101.0971 11.7451 8.6875 68.9183 128.1914 27.8459 112.7366 85.7869 119.0426 186.7892 6.3367 1.6583 0.0658 12.3630 27.4052 0.1910 0.6455 0.9406 21.2408 20.5644 67.3343 16.1618 29.2528 152.6827 5.9813 45.1078 58.0952 119.4095 2.5090 1.4995 3.4912 0.5816 10.1235 94.3644 2.1657 2.8687 10.0478 33.4961 7.6604 7.2805 6.1893 121.1735 7.6805 22.9916 67.3611 37.0039 69.1973 28.3937 36.3174 31.5439 38.7613 0.6012 16.4844 6.1419 28.2085 17.5355 45.1463 39.8992
temp: 298.150 k
press: 1.00000 atm
elementType: 15 8 8 7 7 6 6 6 6 6 6 6 6 6 1 1 1 1 1 1 1 1 1 1 1 1 1
symmnumber: 1
zpe: 562308.9 jmol-1
zpe.correction: 0.214172 hartree
zpe.thermalcorrener: 0.227878 hartree
zpe.thermalcorrenthalpy: 0.228822 hartree
zpe.thermalcorrgfe: 0.172608 hartree
zpe.sumelectzpe: -950.865708 hartree
zpe.sumelectthermal: -950.852002 hartree
zpe.sumelectthermalent: -950.851058 hartree
zpe.sumelectthermalfe: -950.907273 hartree
dipole: -2.4060 -4.3342 1.0560
dipole: 5.0684
quadrupole: -77.1604 -95.6720 -84.8833
quadrupole: 5.8143 5.1163 -0.0820
quadrupole: 8.7448 -9.7668 1.0219 5.8143 5.1163 -0.0820
hfenergy: -951.0798804 hartree
pointgroup: C01 [X(C9H13N2O2P1)]
dipole: 0.9560516 1.7408692 0.1779231 debye
polarizability: 175.474873|-1.5391599|127.9212232|-12.6557957|-13.4881571|97.6119864 unknown
InChI: InChI=1S/C9H13N2O2P/c12-14(10-7-4-8-11-14)13-9-5-2-1-3-6-9/h1-3,5-6,10-11H,4,7-8H2
charge 0 multiplicity 1
27 atoms
P  1.289786 -0.983717 0.033793
O  0.04624 -0.12658 -0.940859
O  0.887087 -2.480369 0.395268
N  1.63075 0.040018 1.3710
N  2.652953 -0.718114 -0.973709
C  3.619593 1.154955 0.373976
C  2.329814 1.334028 1.207135
C  3.331423 0.600441 -1.039635
C  -1.294272 0.016188 -0.50486
C  -1.967302 -0.97723 0.249166
C  -1.958292 1.201908 -0.898689
C  -3.314091 -0.759354 0.618738
C  -3.307612 1.397097 -0.531366
C  -3.990213 0.421697 0.234102
H  4.1210 2.13627 0.271431
H  4.302078 0.467167 0.904764
H  2.583539 1.708715 2.214731
H  1.672423 2.089611 0.725869
H  2.728046 1.336619 -1.613674
H  4.284714 0.453798 -1.578652
H  1.156764 -0.164469 2.250066
H  2.738543 -1.329528 -1.787043
H  -1.446928 -1.903358 0.517319
H  -1.412636 1.945383 -1.488483
H  -3.838279 -1.525953 1.200824
H  -3.823237 2.313397 -0.840744
H  -5.035791 0.577881 0.520533
