program: Gaussian 09
title: 000140052
version: EM64L-G09RevD.01
frameworkgroup: C1[X(C12H17N)]
method: RPBEPBE
basis: SDD
operation: Freq
keyword: #pfreq=noraman
keyword: PBEPBE/SDD
title: #p freq=noraman PBEPBE/SDD
converged: NO YES NO NO
title: Mulliken charges:
elementType: N C C C C C C C C C C C C H H H H H H H H H H H H H H H H H
charge: -0.023668 0.428793 -0.105071 -0.102450 -0.105074 -0.528822 -0.527714 -0.528817 -0.449863 -0.451869 -0.449857 -0.534314 -0.173584 0.203160 0.200435 0.203162 0.196180 0.232330 0.200974 0.200977 0.232335 0.196176 0.200151 0.193894 0.201332 0.197359 0.200151 0.193893 0.249884 0.249917
chargesum: 0.00000
title: Mulliken charges with hydrogens summed into heavy atoms:
elementType: N C C C C C C C C C C C C
charge: -0.023668 0.428793 0.098089 0.097985 0.098088 -0.100311 -0.125763 -0.100307 -0.055818 -0.053178 -0.055813 -0.034513 -0.173584
polarizability: 1.35163486e+02 -6.52820988e+00 1.14463204e+02 -7.40408048e-04 4.98515044e-04 1.06554108e+02
1716.lowfreq: -0.0007 -0.0005 0.0002 15.6040 21.6242 28.1062 71.9169 104.5415 232.6569
frequency: 71.7588 104.4506 232.6529 232.7919 307.1321 347.2816 348.1455 372.3564 372.8266 394.9222 395.3823 428.8077 434.3861 462.7829 616.7147 640.6989 642.5770 707.0473 767.5956 798.2588 809.1875 866.9430 872.4545 874.5592 878.6945 892.0016 939.1284 953.7911 958.5258 979.2559 983.3382 984.7735 1050.5538 1050.8852 1052.3053 1097.3892 1104.7698 1106.4188 1107.7553 1112.9333 1123.3358 1164.7573 1183.1985 1202.8245 1245.1897 1280.4809 1286.8006 1291.8183 1302.0490 1304.4882 1308.0084 1315.8417 1316.5949 1324.9277 1344.5171 1345.1673 1357.6701 1362.0372 1362.9396 1434.5543 1451.1737 1454.1152 1462.5136 1465.9099 1466.5539 1485.0144 2190.4890 2947.8509 2954.9453 2959.2759 2961.5295 2962.2700 2964.8539 2971.3901 2994.6026 2995.7159 3005.5307 3006.7111 3015.2606 3017.0038 3021.9680 3024.9735 3027.8777 3028.2973
redmass: 4.7393 6.6848 2.3324 3.4220 1.9799 2.4980 2.1539 3.9394 3.0700 4.6466 4.4988 1.6934 1.7789 2.0748 4.2996 3.7442 3.8240 4.1360 3.5815 2.6527 2.7809 1.9706 1.5552 1.5634 1.5477 3.8563 2.7653 1.9894 2.4540 2.2776 2.0594 2.5929 1.8094 1.7501 1.7660 1.7583 1.2785 1.3576 1.0394 1.0165 3.1424 1.1709 1.2294 1.0462 1.3691 1.8699 1.7915 1.8749 1.8187 2.1837 1.8153 1.4666 1.4976 1.3146 1.4522 1.4525 1.4599 1.6019 1.6157 1.0866 1.0826 1.0826 1.0907 1.0891 1.0960 1.0913 12.4392 1.0591 1.0604 1.0618 1.0631 1.0606 1.0610 1.0580 1.0843 1.0847 1.1026 1.0847 1.1020 1.1022 1.1024 1.1017 1.1020 1.1002
irintensity: 4.9356 4.3039 1.1111 0.2621 0.0018 0.0628 0.2704 0.6228 0.1629 0.1209 0.1585 0.0623 0.1444 0.1655 4.1978 0.0442 0.0431 0.1730 0.3249 0.9783 1.8055 1.1295 0.0000 0.0252 0.1023 0.0821 0.1972 3.1613 0.8480 4.4224 1.6500 3.8206 0.0337 0.0697 0.0439 6.4240 3.5825 4.1192 0.5751 0.0025 0.1748 0.0134 0.6572 0.7706 1.3628 0.0386 0.5653 0.0156 0.0007 11.7674 0.5235 2.6348 1.5474 0.0061 3.1743 2.6530 6.9450 0.2171 0.0948 8.9154 2.5709 0.7930 19.0765 17.6043 18.4380 0.4595 13.6173 27.9753 27.2969 47.8451 22.6586 32.7513 28.4628 25.5782 134.7476 145.3778 21.7144 34.8300 0.4018 5.7549 27.9565 61.8278 99.1262 27.7664
temp: 298.150 k
press: 1.00000 atm
elementType: 7 6 6 6 6 6 6 6 6 6 6 6 6 1 1 1 1 1 1 1 1 1 1 1 1 1 1 1 1 1
symmnumber: 1
zpe: 694116.8 jmol-1
zpe.correction: 0.264375 hartree
zpe.thermalcorrener: 0.274816 hartree
zpe.thermalcorrenthalpy: 0.275760 hartree
zpe.thermalcorrgfe: 0.229047 hartree
zpe.sumelectzpe: -521.240655 hartree
zpe.sumelectthermal: -521.230214 hartree
zpe.sumelectthermalent: -521.229270 hartree
zpe.sumelectthermalfe: -521.275983 hartree
dipole: -3.6542 2.3396 -0.0005
dipole: 4.3390
quadrupole: -97.5295 -78.0548 -77.4688
quadrupole: 8.8148 -0.0019 -0.0001
quadrupole: -13.1785 6.2963 6.8822 8.8148 -0.0019 -0.0001
hfenergy: -521.50503 hartree
pointgroup: C01 [X(C12H17N1)]
dipole: -1.467138 -0.8727247 0.000204 debye
polarizability: 135.5698435|5.83444|114.0568466|0.0007564|0.0004739|106.5541075 unknown
InChI: InChI=1S/C12H17N/c13-2-1-12-6-9-3-10(7-12)5-11(4-9)8-12/h9-11H,1,3-8H2
charge 0 multiplicity 1
30 atoms
N  3.951983 0.671635 -0.000083
C  0.566454 -0.523697 0.000099
C  -1.09886 0.928078 -1.268492
C  -1.91613 -1.111095 0.000432
C  -1.098721 0.928867 1.268005
C  0.342253 0.350217 -1.267835
C  -0.473024 -1.683591 0.000524
C  0.342398 0.351003 1.267527
C  -2.123685 -0.238116 -1.267892
C  -1.304693 1.801312 -0.000497
C  -2.123539 -0.237334 1.268228
C  1.996872 -1.14348 0.000206
C  3.082046 -0.146186 -0.000322
H  -1.239728 1.548442 -2.175358
H  -2.638939 -1.950791 0.000735
H  -1.239473 1.549782 2.174511
H  0.503917 -0.264054 -2.178252
H  1.082163 1.175075 -1.293933
H  -0.321745 -2.323902 0.894641
H  -0.321869 -2.324484 -0.893197
H  1.082312 1.175878 1.293015
H  0.504167 -0.262708 2.178303
H  -3.156598 0.163529 -1.285759
H  -1.997171 -0.855676 -2.180458
H  -0.589105 2.648039 -0.000816
H  -2.325098 2.234658 -0.000584
H  -3.156454 0.164316 1.285978
H  -1.99692 -0.854315 2.181173
H  2.121106 -1.791251 -0.891054
H  2.12128 -1.790551 0.891951
