program: Gaussian 09
title: 000140034
version: EM64L-G09RevD.01
frameworkgroup: C1[X(C7H8N2)]
method: RPBEPBE
basis: SDD
operation: Freq
keyword: #p
keyword: freq=noraman
keyword: PBEPBE/SDD
title: #p freq=noraman PBEPBE/SDD
converged: NO NO NO NO
title: Mulliken charges:
elementType: N N C C C C C C C H H H H H H H H
charge: -0.034366 -0.034359 -0.259005 -0.259004 -0.213359 -0.271561 -0.291331 -0.291342 -0.442992 0.272609 0.272609 0.266501 0.282811 0.278734 0.278733 0.222661 0.222661
chargesum: 0.00000
title: Mulliken charges with hydrogens summed into heavy atoms:
elementType: N N C C C C C C C
charge: -0.034366 -0.034359 0.013604 0.013605 0.053142 0.011251 -0.012597 -0.012609 0.002329
polarizability: 8.02991362e+01 -1.06857659e+00 6.57510973e+01 -1.16329569e-04 -2.07111917e-03 7.21309569e+01
1716.lowfreq: -28.4371 -16.7088 -9.1690 -0.0011 -0.0010 -0.0009 336.4503 347.8156 434.5975
frequency: 336.4458 347.8153 434.5918 516.3172 563.2339 688.5516 711.1179 782.8643 791.5544 817.1201 817.9525 820.7449 833.1172 890.7519 896.0545 928.5658 937.7870 949.0071 979.5012 993.6859 1005.0881 1024.6798 1059.2032 1061.6690 1112.1536 1160.8174 1170.1016 1210.2698 1216.2427 1224.1999 1225.9003 1251.3034 1257.9886 1297.8079 1332.7191 1402.1382 1466.0178 3007.7480 3066.9421 3108.7985 3123.8861 3132.1189 3173.2754 3188.3131 3206.2589
redmass: 2.5286 5.3216 2.4518 8.8093 6.4431 5.2919 5.0472 2.5302 1.8616 2.4469 4.2892 4.3668 5.3876 2.3856 2.4889 2.4636 2.8198 2.3761 1.8745 1.2119 1.7682 1.7770 1.1769 1.3030 1.3355 1.5031 1.7571 1.6835 1.2715 2.3108 1.4032 1.5711 1.5868 1.7880 2.5304 5.9038 1.0980 1.0599 1.1045 1.0901 1.0894 1.0945 1.0923 1.0921 1.1018
irintensity: 0.1392 8.0591 0.2078 0.5840 0.6914 1.8691 1.8602 15.2609 10.3316 5.9734 6.6265 6.6153 0.1463 10.7724 1.4462 5.1686 3.4295 6.6850 0.3635 1.2304 2.3030 0.4885 0.1074 1.5812 0.0508 13.7000 0.0052 7.1623 0.2913 10.7474 3.2975 25.8419 0.9900 2.0755 1.8972 15.8968 8.6240 38.2394 20.8644 11.3115 33.1411 12.5093 8.3943 4.7389 10.2417
temp: 298.150 k
press: 1.00000 atm
elementType: 7 7 6 6 6 6 6 6 6 1 1 1 1 1 1 1 1
symmnumber: 1
zpe: 362004.5 jmol-1
zpe.correction: 0.137880 hartree
zpe.thermalcorrener: 0.143445 hartree
zpe.thermalcorrenthalpy: 0.144389 hartree
zpe.thermalcorrgfe: 0.108412 hartree
zpe.sumelectzpe: -380.299706 hartree
zpe.sumelectthermal: -380.294142 hartree
zpe.sumelectthermalent: -380.293198 hartree
zpe.sumelectthermalfe: -380.329174 hartree
dipole: 4.3536 -0.5584 -0.0002
dipole: 4.3893
quadrupole: -62.5321 -48.4612 -51.1547
quadrupole: 1.6034 0.0007 0.0008
quadrupole: -8.4828 5.5881 2.8946 1.6034 0.0007 0.0008
hfenergy: -380.4375866 hartree
pointgroup: C01 [X(C7H8N2)]
dipole: -1.7079029 -0.2553455 0.0000801 debye
dipolederiv: 0.1078711 0.054308 0.1129264 0.0631868 -0.2403421 -0.0434527 0.4694245 0.0412838 -0.1536968 0.10786 0.0542571 -0.1129589 0.0629125 -0.2403249 0.043502 -0.4694517 -0.0412241 -0.1537091 -0.0219622 -0.0280568 0.0516541 -0.0756738 0.0178239 -0.0694475 -0.0053996 0.0045866 -0.1532338 -0.0219548 -0.0280898 -0.0516409 -0.0756678 0.0178625 0.069349 0.0054432 -0.0046845 -0.1532563 -0.0366235 -0.0597788 0.0000202 0.0440999 0.035058 0.0000204 -0.0000134 0.0000208 0.1042953 0.0499449 -0.0110065 -0.0000006 -0.0233534 0.0635954 -0.0000568 -0.0000009 -0.0000601 -0.1489083 -0.2214598 -0.0642904 -0.0901521 -0.0453903 0.1611432 0.0888258 -0.0758015 0.0625179 0.2214268 -0.2214472 -0.0642332 0.0901918 -0.0453341 0.1610588 -0.0887991 0.0758226 -0.0624952 0.2215118 -0.0481708 0.0484674 -0.0000126 0.0273762 0.0385565 0.0000455 -0.0000062 0.0000454 0.2054211 0.0782466 0.0085748 0.0417319 0.0206376 -0.036213 0.0826413 0.029321 0.067085 0.0452229 0.0782483 0.0085519 -0.0417358 0.0206197 -0.0362956 -0.0825934 -0.0293305 -0.0670394 0.045307 -0.0695834 0.072293 -0.0000186 0.080391 -0.0033671 0.0000413 -0.0000205 0.0000414 0.1467828 0.0467405 0.0842618 -0.0000229 0.0605825 -0.095958 0.0000518 -0.0000187 0.0000504 0.0884812 0.0660632 0.0098398 0.0088895 -0.0026282 0.056096 -0.0688152 0.0028077 -0.0567243 -0.0999683 0.0660622 0.0098347 -0.0088957 -0.0026366 0.0561636 0.0687307 -0.0028066 0.0566388 -0.100048 0.0200827 -0.0474502 0.0567798 -0.0545282 0.0226177 0.0648313 0.1173554 0.103539 -0.0578632 0.0200822 -0.0474828 -0.0567555 -0.0545938 0.0225248 -0.0648745 -0.1173247 -0.1035815 -0.0577652 unknown
polarizability: 80.2482692|1.3708695|65.8019642|-0.0001595|0.0020682|72.1309569 unknown
InChI: InChI=1S/C7H8N2/c1-2-4-5(2)7-3(1)6(4)8-9-7/h2-7H,1H2
charge 0 multiplicity 1
17 atoms
N  1.831277 0.056958 -0.649027
N  1.831284 0.057371 0.649021
C  -0.450575 1.011426 -0.77374
C  -0.450558 1.011864 0.773186
C  -1.703318 0.540176 -0.00013
C  -0.162325 -1.188653 0.000334
C  0.400553 -0.24545 -1.124938
C  0.400582 -0.24481 1.125075
C  -1.687489 -0.993712 0.000292
H  -0.408533 1.921373 -1.372187
H  -0.408515 1.922144 1.371126
H  -2.630508 1.11635 -0.000284
H  0.231893 -2.214205 0.00062
H  0.398567 -0.580756 -2.169178
H  0.398598 -0.579538 2.169501
H  -2.169807 -1.422871 0.897424
H  -2.169825 -1.423367 -0.896594
