program: Gaussian 09
title: 000140025
version: EM64L-G09RevD.01
frameworkgroup: C1[X(C10H24Si2)]
method: RPBEPBE
basis: SDD
operation: Freq
keyword: #p
keyword: freq=noraman
keyword: PBEPBE/SDD
title: #p freq=noraman PBEPBE/SDD
converged: YES YES NO NO
title: Mulliken charges:
elementType: Si Si C C C C C C C C C C H H H H H H H H H H H H H H H H H H H H H H H H
charge: 1.265800 1.265751 -0.847949 -0.847911 -1.018438 -1.033224 -1.021010 -1.018375 -1.033130 -1.021008 -0.142763 -0.142849 0.232187 0.228926 0.228932 0.232127 0.232656 0.234003 0.233042 0.242564 0.235666 0.231547 0.230741 0.233120 0.243486 0.233035 0.232653 0.233985 0.242443 0.235659 0.231551 0.243496 0.230712 0.233114 0.219668 0.219793
chargesum: 0.00000
title: Mulliken charges with hydrogens summed into heavy atoms:
elementType: Si Si C C C C C C C C C C
charge: 1.265800 1.265751 -0.386837 -0.386853 -0.318737 -0.323446 -0.313664 -0.318701 -0.323476 -0.313687 0.076905 0.076944
polarizability: 2.06684293e+02 -2.45393076e-03 1.38310253e+02 3.03928277e+00 -2.87405379e-03 1.42866311e+02
1716.lowfreq: -10.4014 -0.0009 0.0008 0.0017 4.1602 6.5238 22.8668 31.6052 43.8909
frequency: 22.8046 31.5022 43.8878 54.8794 62.2654 96.2385 99.5073 126.4343 126.7955 135.3340 145.7189 147.9763 158.2039 172.8665 185.4036 194.2029 199.9301 214.1395 214.8838 216.2110 226.5292 265.5524 321.3030 328.6175 489.4434 551.4619 576.7757 651.8570 681.7405 688.7350 689.8049 692.1685 696.2854 728.3292 730.7472 737.5589 738.1451 788.6788 806.4405 836.9431 841.6970 858.7356 894.9407 902.2695 905.0628 906.6954 913.4694 925.9706 961.4027 1008.0327 1074.1775 1101.9725 1169.1189 1174.6987 1187.8337 1287.0021 1288.4939 1290.6043 1291.8030 1297.1197 1301.7900 1304.1452 1307.0378 1430.9937 1431.5695 1441.7911 1442.3546 1444.5772 1447.4239 1447.7415 1448.9059 1452.1788 1454.9832 1456.7340 1457.2846 1462.4294 1463.8095 1663.8315 2964.4479 2965.2679 2976.4825 2976.6351 2976.9934 2977.0836 2978.2438 2978.4900 3029.0086 3029.7876 3063.6187 3073.9136 3078.9598 3079.1180 3079.3177 3079.6683 3079.7583 3079.8810 3081.3266 3081.3469 3081.5455 3081.8338 3082.2034 3082.6133
redmass: 3.1974 2.7490 3.3776 2.9877 2.6002 1.0538 1.0605 1.0575 1.0527 1.3980 2.5745 1.0496 1.3650 2.7327 2.2825 2.3279 2.7165 2.6031 2.6900 2.6817 2.3946 2.0702 4.3027 2.5962 2.4355 3.7239 3.6932 3.7019 3.1710 3.5060 3.5778 3.1882 2.6326 1.2718 1.4372 1.1695 1.1691 1.3534 1.4097 1.5811 1.5539 1.5401 1.5024 1.5169 1.5463 1.6066 1.6032 1.6078 1.1401 1.8035 2.3141 1.2564 1.3459 1.3963 1.3065 1.2049 1.2088 1.2101 1.2026 1.2463 1.1908 1.1916 1.2602 1.0960 1.1110 1.0549 1.0549 1.0543 1.0553 1.0547 1.0541 1.0502 1.0492 1.0504 1.0492 1.0470 1.0479 6.2164 1.0588 1.0583 1.0341 1.0341 1.0341 1.0341 1.0341 1.0341 1.0989 1.0987 1.0939 1.0889 1.0980 1.0983 1.0984 1.0984 1.0984 1.0983 1.0975 1.0976 1.0977 1.0976 1.0976 1.0974
irintensity: 0.0109 0.0254 0.0651 0.0455 0.0180 0.0021 0.0339 0.0403 0.0740 0.1762 0.5908 0.0116 0.2309 0.4041 0.1359 1.6681 0.3143 0.4110 2.4755 4.8924 0.5748 0.0255 11.4008 7.6468 0.0728 0.2194 3.5854 11.8045 0.0047 14.8342 1.2093 23.3251 3.8939 1.9985 0.7309 0.0937 0.0016 9.8905 3.0327 20.0497 2.0083 18.9409 0.6487 188.1342 23.4484 194.9427 105.9924 206.5078 39.1315 23.1195 40.0696 19.3112 72.5870 6.7828 1.7133 54.4665 15.3988 3.1681 86.7826 0.1084 23.5559 18.4876 5.0978 12.0059 7.8499 0.5363 0.0027 0.2160 3.6680 0.3578 0.0007 18.8736 0.1475 9.5465 2.5162 1.8473 24.9929 1.1259 33.1363 26.7673 40.8308 7.2405 35.8864 3.3911 8.3089 7.5334 18.5122 0.5314 0.7445 42.9070 13.0270 2.0843 11.4902 0.9277 0.6276 2.2846 37.0762 33.5866 51.9166 26.0526 28.0261 59.8872
temp: 298.150 k
press: 1.00000 atm
elementType: 14 14 6 6 6 6 6 6 6 6 6 6 1 1 1 1 1 1 1 1 1 1 1 1 1 1 1 1 1 1 1 1 1 1 1 1
symmnumber: 1
zpe: 807327.0 jmol-1
zpe.correction: 0.307495 hartree
zpe.thermalcorrener: 0.328464 hartree
zpe.thermalcorrenthalpy: 0.329408 hartree
zpe.thermalcorrgfe: 0.256798 hartree
zpe.sumelectzpe: -973.273862 hartree
zpe.sumelectthermal: -973.252893 hartree
zpe.sumelectthermalent: -973.251949 hartree
zpe.sumelectthermalfe: -973.324559 hartree
dipole: -0.0006 -0.2648 -0.0007
dipole: 0.2648
quadrupole: -91.7210 -95.8202 -92.6254
quadrupole: 0.0009 0.2379 -0.0015
quadrupole: 1.6679 -2.4313 0.7634 0.0009 0.2379 -0.0015
hfenergy: -973.5813565 hartree
pointgroup: C01 [X(C10H24Si2)]
dipole: 0.0005133 0.1041727 0.0001437 debye
polarizability: 206.7880982|-0.1709295|138.3107213|1.6044869|-0.0179281|142.7620365 unknown
InChI: InChI=1S/C10H24Si2/c1-11(2,3)9-7-8-10-12(4,5)6/h7-8H,9-10H2,1-6H3
charge 0 multiplicity 1
36 atoms
Si 2.834514 0.262692 0.21675
Si -2.831659 0.277434 -0.215378
C  1.954679 -1.463927 0.340927
C  -1.95907 -1.451818 -0.352825
C  4.640177 0.084159 0.837628
C  2.831305 0.852442 -1.606717
C  1.888673 1.52296 1.305629
C  -4.636968 0.112783 -0.841182
C  -2.829663 0.851346 1.613211
C  -1.878123 1.543229 -1.291096
C  0.598844 -1.489928 -0.3272
C  -0.603694 -1.488963 0.315679
H  1.864723 -1.722489 1.414929
H  2.62967 -2.215933 -0.117257
H  -2.637635 -2.204626 0.098747
H  -1.869511 -1.702024 -1.428837
H  5.207874 -0.627427 0.20943
H  5.167616 1.05587 0.809401
H  4.669327 -0.285316 1.879675
H  1.79788 0.992622 -1.974598
H  3.360543 1.817915 -1.711191
H  3.332042 0.119471 -2.266509
H  1.957038 1.254777 2.376439
H  2.29907 2.542641 1.184302
H  0.818181 1.550602 1.028926
H  -4.665971 -0.24557 -1.887111
H  -5.208708 -0.602935 -0.221409
H  -5.160256 1.086419 -0.803509
H  -1.796459 0.986208 1.983619
H  -3.357082 1.816954 1.725319
H  -3.332773 0.113706 2.265953
H  -0.808257 1.564408 -1.011399
H  -1.944688 1.284449 -2.364332
H  -2.284962 2.563405 -1.162148
H  0.60161 -1.490111 -1.429594
H  -0.606787 -1.496525 1.418029
