program: Gaussian 09
title: 000140024
version: EM64L-G09RevD.01
frameworkgroup: C1[X(C14H32Si2)]
method: RPBEPBE
basis: SDD
operation: Freq
keyword: #p
keyword: freq=noraman
keyword: PBEPBE/SDD
title: #p freq=noraman PBEPBE/SDD
converged: YES YES NO NO
title: Mulliken charges:
elementType: Si Si C C C C C C C C C C C C C C H H H H H H H H H H H H H H H H H H H H H H H H H H H H H H H H
charge: 1.296610 1.296632 -0.203812 -0.203754 -0.162870 -0.163052 -0.719395 -0.755683 -0.755703 -0.719391 -1.044882 -1.039519 -1.043090 -1.039514 -1.043083 -1.044881 0.225062 0.225111 0.222791 0.221206 0.210578 0.221433 0.213348 0.222996 0.222963 0.213365 0.221431 0.222794 0.210592 0.221182 0.235112 0.248164 0.234473 0.235211 0.233855 0.236858 0.243062 0.232235 0.236306 0.236849 0.235212 0.233860 0.243030 0.236305 0.232245 0.234473 0.248186 0.235099
chargesum: 0.00000
title: Mulliken charges with hydrogens summed into heavy atoms:
elementType: Si Si C C C C C C C C C C C C C C
charge: 1.296610 1.296632 -0.203812 -0.203754 0.062191 0.062058 -0.064820 -0.097906 -0.097944 -0.064823 -0.327133 -0.333594 -0.331487 -0.333593 -0.331503 -0.327123
polarizability: 2.51673843e+02 -5.21824186e-04 1.87995667e+02 3.65193349e+00 -4.60782286e-04 1.81189327e+02
1716.lowfreq: -10.9581 -6.3143 -3.5046 0.0017 0.0020 0.0021 26.6078 33.5201 44.3893
frequency: 26.5913 33.4116 44.3236 47.4143 50.8467 100.2522 101.7026 114.4120 115.1389 125.6264 134.4745 137.6337 155.3416 162.2887 164.1039 168.5997 182.9137 195.5065 197.2007 203.0851 204.6799 208.0155 228.4053 251.8965 258.3833 259.6189 275.6056 286.5943 290.1265 293.9396 309.3006 330.5033 337.0779 391.7946 400.3308 471.1096 497.3992 538.8609 593.4224 621.0098 677.7262 685.5944 686.2282 691.0837 691.1117 737.2477 738.2177 793.3502 795.9909 800.2678 800.9500 806.9764 834.0336 860.8235 892.9745 896.5441 898.2039 899.8394 903.4566 916.6409 939.9102 940.1677 962.2624 973.9451 976.1273 1002.0613 1004.2129 1106.4874 1134.6621 1137.7868 1149.5026 1220.5798 1227.5998 1283.2272 1284.9827 1287.0935 1287.7329 1290.3823 1297.8459 1300.6136 1310.5695 1373.6275 1374.0755 1390.7838 1392.2163 1440.7667 1440.9168 1443.8046 1445.0491 1445.1966 1449.1023 1450.7234 1452.0174 1452.4957 1456.3396 1460.7048 1463.5521 1470.2754 1470.5651 1472.6314 1473.8013 1484.2061 1484.2211 1490.5850 1491.3953 1643.5287 2958.1187 2958.1294 2960.9571 2961.4095 2975.9623 2976.0327 2977.8463 2977.9662 2979.2649 2979.6436 3047.1768 3047.1941 3050.1467 3050.8500 3060.6142 3061.6236 3064.9916 3065.5028 3068.7689 3076.1579 3076.5067 3076.5391 3079.0522 3080.2020 3081.1440 3081.5086 3082.4543 3082.5780 3083.3863 3083.7737 3083.8021 3084.8532
redmass: 3.3632 2.8664 3.2391 2.9300 2.9821 1.1960 1.1013 1.0457 1.0354 2.0867 1.1320 1.2776 2.1746 2.6316 2.1469 2.2972 2.5953 2.3735 2.3537 2.3033 2.3131 2.3744 2.6475 2.3613 1.0606 1.0589 1.9481 2.3624 1.3018 1.2651 2.2949 2.6527 3.2780 3.4869 2.4475 3.1436 3.4546 3.0673 3.6831 3.7672 2.6789 3.1841 3.1785 3.1188 3.1219 1.1691 1.1680 1.3512 1.3597 1.3453 1.4526 2.4250 2.9072 2.0582 1.4951 1.5012 1.4926 1.4927 1.5227 1.5377 1.5845 1.4757 1.8020 1.8306 1.0971 1.2698 1.3081 2.5767 2.2397 2.0180 2.5970 3.6907 3.4205 1.2043 1.2024 1.2545 1.2040 1.2997 1.1934 1.1916 1.2325 1.1831 1.1797 1.1904 1.1886 1.0551 1.0548 1.0536 1.0538 1.0542 1.0526 1.0515 1.0499 1.0518 1.0500 1.0483 1.0492 1.0476 1.0476 1.0503 1.0496 1.0492 1.0497 1.0499 1.0527 6.2779 1.0349 1.0348 1.0358 1.0358 1.0341 1.0341 1.0341 1.0342 1.0340 1.0339 1.0991 1.0990 1.0975 1.0975 1.0990 1.0996 1.0968 1.0983 1.0927 1.0916 1.0972 1.0981 1.0981 1.0949 1.0974 1.0974 1.0987 1.0984 1.0971 1.0978 1.0977 1.0976
irintensity: 0.0061 0.0011 0.0424 0.0009 0.0026 0.0491 0.0239 0.0174 0.0949 0.0595 0.0425 0.0176 0.0313 0.4848 0.2487 0.0451 0.2342 1.1607 0.0145 0.1028 2.3882 2.5324 0.0041 0.0256 0.0132 0.4285 1.7213 3.2041 0.5824 0.0251 0.0379 1.2267 3.2765 6.8909 0.5117 0.4234 0.6339 1.9302 5.6906 10.7773 2.8605 25.8040 1.6750 18.2138 1.5567 0.2242 0.0122 12.1887 2.0252 0.5762 19.0985 20.1124 14.5216 3.7469 0.1174 93.9122 129.2797 12.8858 194.0719 248.8616 0.9929 7.0455 1.7885 38.2433 47.0371 5.1826 1.7809 3.9797 2.2288 5.1593 2.3000 0.8638 0.1560 61.6792 7.5072 43.6450 5.3287 36.9626 30.4426 31.5728 0.1486 33.4271 1.4755 16.6856 8.8323 0.5585 1.6364 2.0626 1.0207 0.6541 3.1534 20.2977 18.4292 0.2615 0.3788 6.7199 6.5853 1.8439 0.9712 11.0551 0.8416 19.3891 6.2277 3.0291 34.8252 0.2919 18.2932 55.3735 36.3089 55.7615 44.7070 1.1884 36.6663 0.1939 0.8330 14.9151 13.4727 0.0560 33.7333 90.5099 7.1975 8.1218 4.6272 121.3868 3.8215 12.3951 22.8805 14.1489 6.1808 12.4715 42.3203 41.2375 6.1757 2.9334 79.9784 22.2744 33.4778 0.0068
temp: 298.150 k
press: 1.00000 atm
elementType: 14 14 6 6 6 6 6 6 6 6 6 6 6 6 6 6 1 1 1 1 1 1 1 1 1 1 1 1 1 1 1 1 1 1 1 1 1 1 1 1 1 1 1 1 1 1 1 1
symmnumber: 1
zpe: 1096501.3 jmol-1
zpe.correction: 0.417635 hartree
zpe.thermalcorrener: 0.444270 hartree
zpe.thermalcorrenthalpy: 0.445214 hartree
zpe.thermalcorrgfe: 0.362042 hartree
zpe.sumelectzpe: -1130.159066 hartree
zpe.sumelectthermal: -1130.132431 hartree
zpe.sumelectthermalent: -1130.131487 hartree
zpe.sumelectthermalfe: -1130.214659 hartree
dipole: 0.0000 -0.1395 -0.0001
dipole: 0.1395
quadrupole: -118.7481 -121.3224 -120.0161
quadrupole: 0.0000 0.0917 -0.0002
quadrupole: 1.2807 -1.2935 0.0128 0.0000 0.0917 -0.0002
hfenergy: -1130.5767014 hartree
pointgroup: C01 [X(C14H32Si2)]
dipole: 0.0000283 -0.0548904 0.0000455 debye
polarizability: 251.8581901|0.0243521|187.9956762|-0.5553204|-0.0019314|181.0049717 unknown
InChI: InChI=1S/C14H32Si2/c1-13(2,15(5,6)7)11-12-14(3,4)16(8,9)10/h11-12H,1-10H3
charge 0 multiplicity 1
48 atoms
Si 2.795009 -0.812662 -0.062188
Si -2.794531 -0.814649 0.062594
C  1.983469 0.966479 -0.323912
C  -1.984126 0.965174 0.323226
C  0.603292 0.952348 0.31711
C  -0.60401 0.951627 -0.317897
C  2.852318 2.03949 0.400895
C  1.943637 1.28713 -1.839878
C  -1.944248 1.286728 1.838998
C  -2.853758 2.037232 -0.402082
C  1.870916 -2.09745 -1.143312
C  4.6434 -0.768618 -0.580936
C  2.673987 -1.32423 1.782512
C  -4.642499 -0.771922 0.582938
C  -2.674682 -1.326454 -1.782124
C  -1.868583 -2.098575 1.143153
H  0.619469 0.959938 1.418578
H  -0.620263 0.958409 -1.419367
H  2.409982 3.045217 0.257764
H  3.884128 2.06367 0.002463
H  2.910443 1.854194 1.490764
H  1.469328 2.274281 -2.010268
H  2.9660 1.327261 -2.260654
H  1.37258 0.536444 -2.416768
H  -1.372257 0.536974 2.416183
H  -2.966548 1.326061 2.259994
H  -1.470919 2.274468 2.008707
H  -2.412029 3.043312 -0.259561
H  -2.911886 1.851297 -1.491841
H  -3.885537 2.060995 -0.003547
H  2.091227 -1.952931 -2.217049
H  0.777255 -2.016278 -1.002443
H  2.173827 -3.126103 -0.872343
H  5.075023 -1.786619 -0.54496
H  4.764802 -0.388005 -1.612115
H  5.238442 -0.126777 0.09409
H  1.621323 -1.468006 2.087498
H  3.122944 -0.561843 2.445773
H  3.209745 -2.276358 1.955029
H  -5.238599 -0.1305 -0.091551
H  -5.073432 -1.790229 0.547334
H  -4.763256 -0.39141 1.61423
H  -1.622163 -1.469445 -2.087987
H  -3.209829 -2.279036 -1.954033
H  -3.124806 -0.564533 -2.44513
H  -2.170936 -3.127487 0.872544
H  -0.775092 -2.01661 1.00142
H  -2.088157 -1.954099 2.217047
