program: Gaussian 09
title: 000140017
version: EM64L-G09RevD.01
frameworkgroup: C1[X(Br4Cl2N3P3)]
method: RPBEPBE
basis: SDD
operation: Freq
keyword: #p
keyword: freq=noraman
keyword: PBEPBE/SDD
title: #p freq=noraman PBEPBE/SDD
converged: NO YES NO NO
title: Mulliken charges:
elementType: Br Br Br Br Cl Cl P P P N N N
charge: 0.073632 0.073746 0.061144 0.074228 -0.059061 -0.059150 0.600905 0.600903 0.482547 -0.616796 -0.616042 -0.616055
chargesum: 0.00000
title: Mulliken charges with hydrogens summed into heavy atoms:
polarizability: 2.29859725e+02 6.26926806e-03 2.10179925e+02 -1.36246545e+01 -2.17130248e-02 2.21728745e+02
1716.lowfreq: -6.9393 -6.8317 0.0005 0.0011 0.0012 1.5586 6.2505 8.1963 19.6014
frequency: 3.5473 8.0825 19.6005 59.8735 76.9262 81.5422 98.1078 104.9247 105.4947 122.5654 132.2583 139.1730 151.4918 174.5331 184.5332 203.3254 218.2915 219.7675 347.3851 356.1948 375.3689 409.4405 419.2763 437.5679 582.4372 584.4231 636.3793 849.4655 959.3912 966.2881
redmass: 37.4650 43.8492 41.0031 54.6641 58.0499 43.2788 39.4138 29.2101 22.2292 36.6483 31.4232 24.7894 26.5647 32.5803 23.2073 25.8049 24.5978 25.5945 21.6028 22.4885 31.2865 29.9043 14.3872 27.9792 24.6354 24.3874 30.4259 16.0290 15.5763 15.5445
irintensity: 0.0848 0.0342 0.5897 0.0079 0.0384 0.0475 0.1924 0.0034 0.0382 1.5934 2.5710 0.5368 0.6205 2.0209 5.3338 0.0008 0.8204 0.2793 198.4893 176.3808 27.1550 22.5317 8.0419 255.2087 13.6046 12.1206 0.5625 2.0203 942.3022 879.2408
temp: 298.150 k
press: 1.00000 atm
elementType: 35 35 35 35 17 17 15 15 15 7 7 7
symmnumber: 1
zpe: 53997.4 jmol-1
zpe.correction: 0.020567 hartree
zpe.thermalcorrener: 0.038738 hartree
zpe.thermalcorrenthalpy: 0.039682 hartree
zpe.thermalcorrgfe: -0.035506 hartree
zpe.sumelectzpe: -2160.919194 hartree
zpe.sumelectthermal: -2160.901022 hartree
zpe.sumelectthermalent: -2160.900078 hartree
zpe.sumelectthermalfe: -2160.975266 hartree
dipole: -0.2180 -0.0002 -1.2293
dipole: 1.2484
quadrupole: -145.1754 -149.5902 -142.5774
quadrupole: -0.0004 -4.0343 -0.0051
quadrupole: 0.6056 -3.8092 3.2036 -0.0004 -4.0343 -0.0051
hfenergy: -2160.9397603 hartree
pointgroup: C01 [X(Br4Cl2N3P3)]
dipole: -0.2426539 -0.001933 0.4270477 debye
dipolederiv: -0.2147073 0.2008062 -0.1841089 0.2115989 -0.4955089 0.3603799 -0.239224 0.4676667 -0.6188651 -0.2070184 -0.195646 -0.1773608 -0.2063567 -0.5036394 -0.3638091 -0.2300589 -0.4717755 -0.6176875 -0.5186208 -0.0038948 -0.419832 -0.0038757 -0.1133939 -0.003918 -0.4889456 -0.0047837 -0.7949103 -0.7032882 -0.0057148 0.4002785 -0.0057291 -0.0937077 0.0037889 0.4737253 0.0044019 -0.5367909 -0.35099 0.2218568 0.1914886 0.2293224 -0.5192119 -0.2740732 0.2255975 -0.3007725 -0.5893394 -0.3425246 -0.2183516 0.1861986 -0.2258373 -0.5274691 0.2776378 0.2202482 0.3053539 -0.5901491 1.8638835 -0.6423621 0.1628055 -0.655062 2.5367466 -0.1246108 0.1061709 -0.2669496 1.5015957 1.8395627 0.6294463 0.161138 0.6421134 2.5614307 0.1268077 0.0992685 0.2668268 1.5010742 2.951913 0.0147076 0.2028089 0.0148214 1.3854009 0.0010147 0.1619574 0.0021087 1.657976 -0.577656 0.0156565 -0.0620074 0.0156746 -2.2377573 0.0000927 -0.0074463 0.0006021 -0.3101475 -1.8843296 0.7255358 -0.2316448 0.7318095 -0.9824359 0.0911582 -0.1616174 0.0693269 -0.3014088 -1.8562242 -0.7420399 -0.2297643 -0.7484793 -1.010454 -0.0944689 -0.1596757 -0.0720056 -0.3013473 unknown
polarizability: 220.3547698|0.1066394|210.1810128|13.1365981|0.1160217|231.2326129 unknown
InChI: InChI=1S/Br4Cl2N3P3/c1-10(2)7-11(3,5)9-12(4,6)8-10
charge 0 multiplicity 1
12 atoms
Br 1.484244 -2.759333 1.959404
Br 1.432836 2.788618 1.957123
Br -2.954262 -0.028012 -2.193396
Br -3.398671 -0.032187 1.46538
Cl 1.732387 -2.695306 -1.5713
Cl 1.680139 2.726209 -1.573663
P  0.867117 -1.468263 0.078041
P  0.839184 1.484439 0.077321
P  -1.6953 -0.016132 -0.179386
N  1.708894 0.016184 0.101811
N  -0.834252 -1.492418 -0.061132
N  -0.862515 1.4762 -0.060103
