program: Gaussian 09
title: 000139926
version: EM64L-G09RevD.01
frameworkgroup: C1[X(C11H16O)]
method: RPBEPBE
basis: SDD
operation: Freq
keyword: #pfreq=noraman
keyword: PBEPBE/SDD
title: #p freq=noraman PBEPBE/SDD
converged: NO YES NO NO
title: Mulliken charges:
elementType: O C C C C C C C C C C C H H H H H H H H H H H H H H H H
charge: -0.318516 0.289566 -0.695716 -0.695367 -0.695766 0.306302 -0.335996 -0.336107 0.444699 -0.379975 -0.379802 -0.807272 0.220146 0.212430 0.233909 0.229283 0.229245 0.197667 0.233962 0.212408 0.220148 0.238030 0.237978 0.228299 0.228300 0.223455 0.235230 0.223458
chargesum: 0.00000
title: Mulliken charges with hydrogens summed into heavy atoms:
elementType: O C C C C C C C C C C C
charge: -0.318516 0.289566 -0.029230 -0.039172 -0.029248 0.306302 -0.097966 -0.098129 0.444699 -0.151675 -0.151501 -0.125129
polarizability: 1.69013441e+02 4.15803727e-03 1.17625055e+02 -6.23767647e+00 -5.71204518e-04 8.01702842e+01
1716.lowfreq: -24.6520 -10.0705 -0.0008 0.0005 0.0005 10.8431 19.6572 35.7183 75.0515
frequency: -23.1779 35.1663 75.0316 82.1092 173.0765 178.9526 244.0496 264.0834 265.4240 274.6502 324.2184 324.5693 377.2454 388.6550 417.1102 435.2472 444.8432 482.8829 561.1043 635.4936 656.5579 727.8723 758.2216 799.0115 836.6893 838.3142 859.2060 904.2462 920.8147 948.2942 948.7431 966.3635 985.4804 1006.6205 1020.5248 1027.7788 1046.4281 1109.9771 1152.9340 1175.1379 1206.4086 1221.3143 1246.7820 1269.1434 1291.6544 1358.3504 1371.3923 1375.5465 1397.6352 1397.8387 1402.3832 1446.5898 1463.5054 1465.5283 1471.7292 1473.0853 1473.4153 1475.6254 1490.7082 1495.7786 1578.9209 1614.3718 2973.6684 2982.2315 2985.4931 2993.5835 3054.2844 3078.0267 3083.1970 3083.3130 3087.8990 3092.2515 3096.1745 3100.1461 3118.1467 3120.5749 3155.5906 3159.9321
redmass: 1.0218 3.0566 3.5728 3.7056 1.0161 3.6963 1.1568 2.3529 1.2687 1.8504 3.5896 2.6257 2.5512 2.6628 2.9489 2.5142 3.6855 3.2933 3.1624 6.9383 4.3665 2.9010 4.1755 3.1909 1.9063 1.2384 4.0177 1.6069 1.6078 1.3288 1.2026 1.3619 1.4011 2.7725 1.4273 1.4159 1.5455 1.2683 2.2119 1.3352 2.2414 3.5651 2.9484 3.2152 1.3123 5.1976 1.2392 1.2440 1.2217 1.2165 3.3171 1.0487 1.0519 1.0470 1.0731 1.0760 1.0525 1.0678 2.0690 1.1821 6.3266 6.3860 1.0387 1.0348 1.0351 1.0355 1.0949 1.0993 1.0989 1.0997 1.1014 1.1000 1.0994 1.0999 1.0892 1.0888 1.0947 1.0957
irintensity: 0.6832 0.0540 1.4042 1.6008 0.0038 0.7637 0.0270 0.0412 0.1030 0.6445 0.0043 0.6848 2.3855 0.9955 0.0007 2.2819 7.6695 15.1160 16.5880 0.2564 0.1213 3.1761 9.8333 1.0922 41.0222 0.0355 76.4964 0.1983 5.6217 4.3833 0.0211 0.1460 0.0122 8.5583 0.3351 1.5010 19.9018 16.9734 237.5660 59.8723 13.2954 2.6048 23.1095 25.9012 0.2612 0.3616 37.1152 30.7366 1.7412 30.8813 0.3603 0.7997 2.1909 1.4038 11.3766 1.6722 11.4044 11.4392 64.8290 64.5938 4.2364 5.7819 43.1715 21.0159 13.8085 24.2086 23.8927 1.4249 40.5667 18.5306 6.3007 34.6947 61.2497 36.5415 15.8683 23.7468 22.2071 2.1391
temp: 298.150 k
press: 1.00000 atm
elementType: 8 6 6 6 6 6 6 6 6 6 6 6 1 1 1 1 1 1 1 1 1 1 1 1 1 1 1 1
symmnumber: 1
zpe: 626994.8 jmol-1
zpe.correction: 0.238810 hartree
zpe.thermalcorrener: 0.251220 hartree
zpe.thermalcorrenthalpy: 0.252164 hartree
zpe.thermalcorrgfe: 0.200464 hartree
zpe.sumelectzpe: -503.068942 hartree
zpe.sumelectthermal: -503.056532 hartree
zpe.sumelectthermalent: -503.055588 hartree
zpe.sumelectthermalfe: -503.107288 hartree
dipole: -0.0560 0.0014 1.7119
dipole: 1.7128
quadrupole: -63.8041 -68.3328 -78.3774
quadrupole: 0.0032 1.6496 -0.0029
quadrupole: 6.3674 1.8386 -8.2060 0.0032 1.6496 -0.0029
hfenergy: -503.3077522 hartree
pointgroup: C01 [X(C11H16O1)]
dipole: 0.0318607 -0.0018098 0.6731029 debye
polarizability: 169.176769|-0.0307631|117.6249414|4.9366074|0.0678711|80.0070698 unknown
InChI: InChI=1S/C11H16O/c1-9-5-7-10(8-6-9)12-11(2,3)4/h5-8H,1-4H3
charge 0 multiplicity 1
28 atoms
O  -1.384909 0.003471 -0.834125
C  -2.452855 0.001056 0.244464
C  -2.33048 1.271568 1.112212
C  -3.748827 0.004929 -0.582878
C  -2.332744 -1.275436 1.103741
C  -0.020388 0.001645 -0.452067
C  0.680241 -1.221885 -0.32079
C  0.681991 1.223681 -0.316125
C  2.783204 -0.001374 0.10347
C  2.064872 -1.21643 -0.04395
C  2.066602 1.215258 -0.039336
C  4.280074 -0.002909 0.364936
H  -2.400946 2.177109 0.484045
H  -3.147481 1.299441 1.856297
H  -1.370252 1.293123 1.65709
H  -3.789181 -0.886541 -1.232205
H  -3.788077 0.901114 -1.225746
H  -4.632385 0.00306 0.080476
H  -1.372463 -1.302297 1.648294
H  -3.149648 -1.306822 1.8478
H  -2.404936 -2.176604 0.469511
H  0.137266 -2.163271 -0.45518
H  0.14024 2.166284 -0.44686
H  2.597001 -2.171056 0.052871
H  2.600083 2.168759 0.061089
H  4.591747 -0.897893 0.932045
H  4.851189 -0.000798 -0.584194
H  4.592762 0.888816 0.936612
