program: Gaussian 09
title: 000139909
version: EM64L-G09RevD.01
frameworkgroup: C1[X(C7H7ClFN)]
method: RPBEPBE
basis: SDD
operation: Freq
keyword: #p
keyword: freq=noraman
keyword: PBEPBE/SDD
title: #p freq=noraman PBEPBE/SDD
converged: YES YES NO NO
title: Mulliken charges:
elementType: Cl F N C C C C C C C H H H H H H H
charge: -0.061115 -0.204618 -0.606746 0.516396 -0.500908 -0.265854 -0.330930 -0.382012 -0.379901 0.343448 0.229939 0.238975 0.297726 0.281982 0.257063 0.287834 0.278720
chargesum: 0.00000
title: Mulliken charges with hydrogens summed into heavy atoms:
elementType: Cl F N C C C C C C C
charge: -0.061115 -0.204618 -0.040192 0.516396 -0.031993 -0.265854 -0.033204 -0.100030 -0.122838 0.343448
polarizability: 1.13468946e+02 -4.82364656e+00 1.06241085e+02 2.07049107e+00 7.85524313e-01 4.36871178e+01
1716.lowfreq: -11.2004 -9.8164 -0.0014 0.0014 0.0023 7.7125 67.6506 125.1564 177.0578
frequency: 67.6287 125.1492 177.0573 179.6806 198.5924 228.3709 320.3842 355.7479 389.4359 443.7212 449.2428 534.6206 565.1902 593.6309 669.1340 685.4042 731.1628 824.9784 853.9099 856.5884 910.6389 986.2325 1016.6675 1081.9305 1116.8690 1141.4124 1162.2077 1217.7737 1232.7719 1293.5568 1344.6394 1390.0023 1391.7039 1453.9015 1474.6729 1586.2291 1606.3590 1646.0250 2929.9421 3013.2767 3148.0589 3177.7627 3187.1630 3495.1052 3624.9616
redmass: 2.6742 2.8350 5.8931 6.2242 1.2450 6.6946 4.2356 6.4918 9.6225 5.9444 3.2270 2.7331 4.0178 1.7215 7.3338 2.9452 4.1923 1.2942 1.8949 3.7072 1.4733 1.2901 2.9091 2.5067 1.4214 1.3909 1.9857 5.1598 1.4066 1.2291 1.9965 2.3812 4.3324 1.4322 1.8636 8.2711 7.1245 1.0986 1.0681 1.0916 1.0892 1.0957 1.0936 1.0459 1.0986
irintensity: 1.8467 2.0809 1.3342 0.9225 48.8743 2.6440 4.1060 2.3898 4.7134 8.5657 9.1044 57.6646 14.0708 157.0579 15.8881 2.3240 6.9538 20.4255 53.2074 74.8931 9.2135 4.6650 27.4436 17.4085 6.4699 3.3025 20.5800 47.2284 0.7734 1.4189 13.0827 19.1748 6.7468 73.3153 49.3119 52.3081 51.0957 45.7425 36.1378 17.9364 1.8807 4.9087 1.1196 2.0096 5.2715
temp: 298.150 k
press: 1.00000 atm
elementType: 17 9 7 6 6 6 6 6 6 6 1 1 1 1 1 1 1
symmnumber: 1
zpe: 328252.3 jmol-1
zpe.correction: 0.125025 hartree
zpe.thermalcorrener: 0.134609 hartree
zpe.thermalcorrenthalpy: 0.135554 hartree
zpe.thermalcorrgfe: 0.089711 hartree
zpe.sumelectzpe: -884.855434 hartree
zpe.sumelectthermal: -884.845849 hartree
zpe.sumelectthermalent: -884.844905 hartree
zpe.sumelectthermalfe: -884.890748 hartree
dipole: -2.9515 -1.6214 0.3620
dipole: 3.3870
quadrupole: -62.0297 -62.5689 -65.2757
quadrupole: 4.7700 -0.6790 -1.3434
quadrupole: 1.2617 0.7226 -1.9842 4.7700 -0.6790 -1.3434
hfenergy: -884.9804587 hartree
pointgroup: C01 [X(C7H7Cl1F1N1)]
dipole: 1.1955854 0.5291706 0.2572715 debye
dipolederiv: -0.2681012 0.2470911 0.085537 0.2336316 -0.6195771 -0.16901 0.0733891 -0.1710227 -0.1299916 -1.1780387 0.0205919 0.0802619 -0.0230823 -0.2207999 -0.0174012 0.0774568 -0.0187627 -0.1611998 -0.6263896 0.0376439 -0.1298753 -0.0462026 -0.7195591 -0.0214338 -0.1708374 -0.0618212 -0.2630672 0.0324154 0.0462658 -0.0232612 0.0415519 -0.4186007 -0.1165615 -0.0734636 -0.1349894 -0.0406506 0.41871 0.2457945 0.1465057 0.2291392 0.4832134 0.0148625 0.2177871 0.1054464 0.2353737 0.3467634 -0.3208098 -0.1296415 -0.3446924 0.9399545 0.3166656 -0.137336 0.3151948 0.0151752 -0.0282149 -0.116266 -0.0499578 0.0237537 0.0505238 0.0384864 0.0118678 0.0533411 -0.125726 -0.3193698 0.0674482 0.0320362 0.2087375 -0.2527706 -0.0581047 0.0794037 -0.0456712 -0.137085 -0.211231 -0.0002719 0.0045793 -0.1646787 -0.0491288 0.0456405 -0.0396028 0.0314263 -0.1597787 1.2613083 0.0019711 -0.0871885 -0.0069715 0.322465 0.0629933 -0.1001699 0.0650387 0.1109664 -0.0287387 0.0019457 -0.0395837 0.0398349 -0.1638317 0.0419377 -0.0434133 0.0587121 0.0524554 -0.0217554 -0.0302259 0.0481993 -0.0715878 0.0634272 -0.0016703 0.0597339 -0.0168616 -0.0983918 0.1707832 -0.0165107 0.0002248 -0.0257904 0.015164 -0.0328518 0.0058429 -0.0337644 0.1445119 0.0774071 -0.0387114 -0.0026181 -0.0518976 0.0456157 -0.0342733 -0.0047184 -0.0368936 0.1799923 0.0438682 0.0605982 0.024817 0.0738323 0.015602 -0.0494574 0.025549 -0.0513835 0.168646 0.067408 -0.1390425 0.0659579 -0.0304013 0.2920793 -0.0557098 0.0380454 -0.056793 0.170785 0.2631756 -0.0675122 -0.0259929 -0.0851765 0.2162229 0.0358877 -0.0195344 -0.001196 0.0379851 unknown
polarizability: 112.681537|-3.4697084|101.6252053|-6.3491273|17.1449324|49.090406 unknown
InChI: InChI=1S/C7H7ClFN/c8-7-3-6(9)2-1-5(7)4-10/h1-3H,4,10H2
charge 0 multiplicity 1
17 atoms
Cl 0.997642 -2.578862 -0.898711
F  -3.353603 0.044046 0.141339
N  2.970741 1.379392 0.360597
C  0.867592 0.130792 -0.146698
C  2.395282 0.172631 -0.250708
C  0.123593 -1.043611 -0.406847
C  0.133085 1.288383 0.212237
C  -1.280195 -1.102717 -0.321429
C  -1.274754 1.281915 0.31197
C  -1.948292 0.078902 0.043585
H  2.797654 -0.776501 0.167678
H  2.672514 0.164705 -1.323141
H  0.717583 2.194441 0.403155
H  -1.836307 -2.020343 -0.52698
H  -1.8375 2.178015 0.587856
H  3.815239 1.734802 -0.088979
H  3.040726 1.35781 1.380776
