program: Gaussian 09
title: 000139904
version: EM64L-G09RevD.01
frameworkgroup: C1[X(C8H12)]
method: RPBEPBE
basis: SDD
operation: Freq
keyword: #p
keyword: freq=noraman
keyword: PBEPBE/SDD
title: #p freq=noraman PBEPBE/SDD
converged: NO NO NO NO
title: Mulliken charges:
elementType: C C C C C C C C H H H H H H H H H H H H
charge: -0.216231 -0.216273 -0.201556 -0.201526 -0.169163 -0.169190 -0.739925 -0.739919 0.218834 0.218849 0.222010 0.222001 0.213080 0.213090 0.224754 0.223457 0.224752 0.224754 0.224750 0.223454
chargesum: 0.00000
title: Mulliken charges with hydrogens summed into heavy atoms:
elementType: C C C C C C C C
charge: 0.002603 0.002576 0.020453 0.020474 0.043917 0.043900 -0.066962 -0.066962
polarizability: 2.30208708e+02 -1.88573756e+01 7.43879394e+01 4.83179493e-03 -2.05789309e-03 4.75010981e+01
1716.lowfreq: -1.3726 -0.0008 0.0005 0.0006 7.0668 46.0526 65.2382 80.0487 137.8420
frequency: 65.2382 80.0487 137.8420 150.1701 204.8792 207.1822 207.7002 297.6445 328.1731 366.7576 379.3477 533.9550 550.2156 769.5425 815.9869 893.8118 916.6492 925.6051 936.8524 969.9095 1012.5632 1037.5690 1038.3682 1080.7794 1098.7194 1164.9092 1184.6293 1221.4546 1269.2696 1283.0672 1291.3018 1300.4160 1340.3178 1391.1651 1391.5625 1458.8984 1458.9837 1467.0966 1470.4604 1607.0356 1649.3701 1666.2182 2959.0954 2959.4964 3030.8701 3030.9704 3067.7369 3067.8179 3073.2525 3073.3430 3079.3404 3085.8935 3092.0282 3094.6732
redmass: 3.4735 3.3457 1.1380 1.6096 1.6477 3.0807 1.7747 2.0638 4.3746 2.8729 2.7433 2.7298 3.4953 1.3068 1.5345 2.0623 1.5816 1.1638 1.4946 1.0962 1.0876 1.5285 1.5167 3.1800 2.0735 2.4368 2.0549 1.3286 1.3156 1.5475 1.3092 1.2645 1.4542 1.2273 1.2436 1.0480 1.0479 1.0714 1.0641 5.5066 5.3001 5.7167 1.0365 1.0365 1.0967 1.0967 1.0940 1.0941 1.0909 1.0924 1.0951 1.0927 1.0907 1.0874
irintensity: 1.8078 1.0307 0.0001 0.0000 2.8343 0.0000 0.0000 0.0000 0.0000 1.2878 2.4811 0.0000 5.9419 0.0000 12.5359 0.0000 59.0231 1.8172 0.0000 0.0000 165.4996 0.0000 5.8253 0.0000 3.9558 8.4111 0.0000 0.5686 0.0000 0.0000 5.7124 0.0000 7.1076 0.0013 12.9998 0.0007 30.2147 0.0000 41.4631 0.0000 0.0000 13.9453 119.3126 0.0077 0.1598 56.2334 0.1151 7.0960 5.8486 0.0624 0.0001 9.4483 0.0053 184.6089
temp: 298.150 k
press: 1.00000 atm
elementType: 6 6 6 6 6 6 6 6 1 1 1 1 1 1 1 1 1 1 1 1
symmnumber: 1
zpe: 450012.3 jmol-1
zpe.correction: 0.171401 hartree
zpe.thermalcorrener: 0.181353 hartree
zpe.thermalcorrenthalpy: 0.182297 hartree
zpe.thermalcorrgfe: 0.136548 hartree
zpe.sumelectzpe: -311.389666 hartree
zpe.sumelectthermal: -311.379714 hartree
zpe.sumelectthermalent: -311.378770 hartree
zpe.sumelectthermalfe: -311.424518 hartree
dipole: 0.0001 -0.0001 -0.0001
dipole: 0.0002
quadrupole: -40.5731 -45.2441 -54.7625
quadrupole: -0.5883 0.0004 -0.0006
quadrupole: 6.2868 1.6158 -7.9026 -0.5883 0.0004 -0.0006
hfenergy: -311.5610669 hartree
pointgroup: C01 [X(C8H12)]
dipole: -0.0000495 -0.000026 0.0000261 debye
dipolederiv: 0.0741158 0.0098785 0.0000003 -0.0249118 0.1232512 0.0000071 0.0000267 0.0000211 -0.1654654 0.0740654 0.0098681 0.0000106 -0.0249301 0.1232589 0.0000339 -0.0000178 0.0000206 -0.1654703 -0.0543971 0.0214977 0.000017 -0.2372357 0.0846424 0.0000463 -0.0000477 0.0000388 -0.1692856 -0.054365 0.0215153 -0.0000135 -0.2372147 0.0846321 -0.0000252 0.0000233 -0.0000054 -0.1692842 0.2706067 -0.0234607 0.0000114 -0.0247282 0.1640698 0.0000661 -0.0000088 0.0000724 -0.2700359 0.2705577 -0.0234801 0.0000141 -0.0247683 0.1640666 -0.0000152 0.0000381 -0.000024 -0.2700452 -0.2664276 0.0464467 0.000005 -0.1032709 0.0250439 -0.0000131 -0.0000345 -0.0000116 0.1002355 -0.2664031 0.0464735 -0.0000218 -0.1032248 0.025022 -0.0000001 0.0000127 0.0000058 0.1002422 0.0333386 0.0035378 -0.0000061 0.0634984 -0.129347 -0.000019 0.0000014 -0.0000218 0.1678548 0.0333445 0.0035304 0.000001 0.0634933 -0.1293377 -0.0000203 -0.0000007 -0.0000195 0.1678628 0.0353209 -0.0018059 -0.0000013 0.0860448 -0.1311359 -0.0000478 0.0000131 -0.000047 0.1632859 0.0353268 -0.0018228 -0.0000051 0.0860338 -0.1311393 0.0000147 -0.0000093 0.0000121 0.1632802 0.0257446 0.0553837 0.0000051 0.0529382 -0.1541342 -0.0000549 0.000011 -0.0000486 0.1699791 0.0257571 0.0553664 -0.0000071 0.0529234 -0.1541293 0.0000208 -0.0000158 0.0000122 0.1699875 -0.0934939 -0.028458 -0.1002399 0.0550093 0.0872736 -0.0755381 -0.180764 -0.0595923 -0.0529029 0.068712 -0.0544899 -0.0000147 0.0777403 -0.1568717 -0.0000635 0.0000255 -0.000063 0.1091548 -0.0935112 -0.0285089 0.1002226 0.054925 0.0872061 0.0756103 0.1807789 0.0596561 -0.0528171 -0.0935121 -0.0284543 0.1002533 0.0550156 0.0872736 0.075531 0.1807821 0.0595786 -0.0528815 -0.0935018 -0.0284858 -0.1002414 0.0549626 0.0872228 -0.0755825 -0.1807879 -0.0596267 -0.0528468 0.0687219 -0.0545318 0.0000106 0.0776996 -0.156868 0.0000497 -0.0000264 0.0000421 0.1091523 unknown
polarizability: 230.4684965|17.7497237|74.128151|0.0048463|0.0020236|47.5010981 unknown
InChI: InChI=1S/C8H12/c1-3-5-7-8-6-4-2/h3-8H,1-2H3
charge 0 multiplicity 1
20 atoms
C  -0.594148 -0.347608 0.000345
C  0.594131 0.347502 0.000414
C  -1.911265 0.275672 0.000381
C  1.911217 -0.275854 0.000424
C  -3.09408 -0.415206 0.000213
C  3.09409 0.41493 0.000388
C  -4.467015 0.21331 0.000291
C  4.466943 -0.213779 0.000467
H  -0.566624 -1.448769 0.000265
H  0.566649 1.44866 0.000488
H  -1.938703 1.376745 0.000562
H  1.938569 -1.376929 0.00047
H  -3.061221 -1.516367 0.000027
H  3.061342 1.516088 0.000328
H  -5.050716 -0.099322 -0.88839
H  -4.408176 1.316315 0.000557
H  -5.050784 -0.099763 0.888769
H  5.050744 0.098815 -0.888161
H  5.050724 0.099137 0.888996
H  4.407921 -1.316775 0.000665
