program: Gaussian 09
title: 000139897
version: EM64L-G09RevD.01
frameworkgroup: C1[X(C10H13Cl)]
method: RPBEPBE
basis: SDD
operation: Freq
keyword: #p
keyword: freq=noraman
keyword: PBEPBE/SDD
title: #p freq=noraman PBEPBE/SDD
converged: NO YES NO NO
title: Mulliken charges:
elementType: Cl C C C C C C C C C C H H H H H H H H H H H H H
charge: -0.078164 -0.228172 0.674667 -0.690622 -0.689832 -0.554000 -0.395554 0.445739 -0.216194 -0.408882 -0.815465 0.232009 0.208903 0.215271 0.230674 0.230814 0.215188 0.208383 0.235684 0.253041 0.237007 0.227026 0.225237 0.237241
chargesum: 0.00000
title: Mulliken charges with hydrogens summed into heavy atoms:
elementType: Cl C C C C C C C C C C
charge: -0.078164 0.003837 0.674667 -0.035774 -0.035447 -0.318317 -0.395554 0.445739 0.036848 -0.171875 -0.125961
polarizability: 1.46619954e+02 -2.70862715e+00 1.26440307e+02 3.21689989e-01 -2.61330392e-01 7.10639849e+01
1716.lowfreq: -19.9616 -8.9513 -5.5849 -4.7651 0.0017 0.0018 0.0019 11.9603 98.4164
frequency: -17.3461 8.9255 98.3998 120.7952 166.8597 211.7101 212.1819 242.9064 280.3276 306.4084 336.9200 357.2083 381.1666 459.2609 489.4498 548.0477 590.3294 611.4052 697.3394 735.1612 814.4238 855.3881 896.7508 917.8424 920.0105 953.2116 956.0422 995.8238 1013.4219 1048.1524 1083.0427 1115.2135 1124.5411 1155.0162 1186.1613 1233.7631 1282.5262 1319.0264 1327.0021 1376.5343 1376.8278 1395.7754 1398.0797 1401.1182 1463.4383 1466.7523 1468.0045 1473.1654 1474.1374 1479.6990 1487.7169 1584.7058 1607.2006 2975.7165 2976.0817 2978.5438 3024.8126 3056.8334 3068.3486 3077.6660 3080.4143 3084.9317 3085.7314 3112.6281 3132.1300 3166.6919
redmass: 2.7442 1.0150 4.2347 3.1246 3.5282 3.7312 1.0631 1.0941 3.5536 2.7880 3.8549 7.3885 2.8158 2.9438 3.4929 3.2477 3.5892 5.1493 4.8887 3.5706 1.3026 3.1262 1.4245 2.4356 1.1890 1.3411 1.4352 1.5286 5.1268 1.5632 1.4911 2.6795 1.9745 1.4210 1.8450 1.8552 1.8908 1.2982 1.9000 1.1990 3.4112 1.2542 1.2504 2.4402 2.3488 1.0473 1.0497 1.0605 1.1255 1.0483 1.1046 6.4040 6.4306 1.0387 1.0348 1.0354 1.0847 1.0951 1.0999 1.0985 1.1005 1.0995 1.0998 1.0905 1.0895 1.0960
irintensity: 0.0083 0.4695 0.2325 1.4237 1.2059 0.2707 0.0383 0.0647 1.3674 0.2498 0.1536 5.4789 0.3661 15.0846 0.3353 0.1026 2.0106 17.1460 4.0512 0.5901 39.2627 1.6979 5.2514 8.5513 2.6236 0.7839 0.0104 8.1386 51.6831 18.5464 12.9750 1.9982 7.4723 6.0681 7.7206 0.1015 4.6082 0.5849 8.7939 15.8005 2.4020 6.5053 10.2064 8.4855 45.9981 0.0733 6.1762 12.8714 11.5118 16.4192 30.5917 0.0295 2.8223 34.1630 30.4242 32.9629 0.1400 21.5989 0.3648 93.4565 22.9223 32.8667 16.7921 19.5319 11.6931 6.9812
temp: 298.150 k
press: 1.00000 atm
elementType: 17 6 6 6 6 6 6 6 6 6 6 1 1 1 1 1 1 1 1 1 1 1 1 1
symmnumber: 1
zpe: 522324.6 jmol-1
zpe.correction: 0.198943 hartree
zpe.thermalcorrener: 0.210180 hartree
zpe.thermalcorrenthalpy: 0.211124 hartree
zpe.thermalcorrgfe: 0.160284 hartree
zpe.sumelectzpe: -848.103762 hartree
zpe.sumelectthermal: -848.092525 hartree
zpe.sumelectthermalent: -848.091580 hartree
zpe.sumelectthermalfe: -848.142421 hartree
dipole: 1.7760 -1.5587 0.0502
dipole: 2.3635
quadrupole: -68.2868 -70.9442 -76.7841
quadrupole: 3.4506 0.1786 -0.0664
quadrupole: 3.7182 1.0608 -4.7790 3.4506 0.1786 -0.0664
hfenergy: -848.3027046 hartree
pointgroup: C01 [X(C10H13Cl1)]
dipole: -0.4832366 0.7942495 0.0177731 debye
dipolederiv: -0.4387864 0.3314422 -0.0017574 0.3288118 -0.5574024 0.0019089 -0.0028714 0.0032026 -0.0830226 0.1465449 0.046853 -0.000172 -0.0839833 0.033119 0.0004403 0.0001386 0.0029546 0.1297779 0.1322899 0.2486412 -0.0034276 0.171194 -0.1610823 -0.0009884 0.0039045 -0.0053227 -0.0629153 -0.0064606 -0.066216 -0.0208803 -0.0289164 0.0534248 -0.0307628 0.0476818 -0.0160979 -0.0307389 -0.0058902 -0.0669324 0.0213825 -0.0298318 0.0535455 0.0303975 -0.0474476 0.0151106 -0.0313039 -0.1709256 0.0050181 0.003622 0.0993488 0.0231157 0.0056958 0.0079627 -0.000775 -0.163273 0.4264903 -0.5548295 0.0066316 -0.5269514 0.6996823 -0.0071998 0.0047498 -0.004343 -0.0889005 0.1880861 -0.1833504 -0.0128724 -0.2422766 0.190486 0.0112672 -0.062272 0.0533721 -0.0296397 -0.1248224 0.1152483 0.002501 0.1074238 -0.0938084 0.0051727 0.0060332 -0.0019291 -0.0816668 -0.0006014 0.0597395 -0.0040625 0.109598 -0.082773 -0.0040708 0.0013398 -0.0073256 -0.1845857 -0.0246607 0.094613 0.0093151 0.1117414 -0.0381966 -0.0050906 0.079895 -0.0672668 0.0675342 0.0015713 0.0429249 -0.0003841 0.1081696 -0.0274231 0.0003219 -0.0008631 0.0003527 0.0259772 0.0234588 0.1403684 0.0089754 0.0983353 -0.0788653 -0.0360915 -0.0192055 0.0236354 0.0653185 -0.1995142 -0.096133 -0.0311289 -0.0901601 0.0552248 -0.0291494 -0.0104801 -0.0228491 0.0780621 0.1025093 -0.0203946 0.0540392 -0.0044487 0.0216737 0.112657 0.0341941 0.0737086 -0.1106433 0.1028241 -0.0205124 -0.0529271 -0.0043735 0.0200675 -0.1138159 -0.0331105 -0.0749627 -0.109029 -0.1996134 -0.0960862 0.0309452 -0.0899548 0.055635 0.028825 0.010107 0.0226587 0.0778685 0.0234439 0.1409815 -0.0104154 0.0987612 -0.0786486 0.0373909 0.018192 -0.0217102 0.0652953 0.080941 -0.0375307 -0.0027213 -0.0530976 -0.107028 0.0014367 -0.0021043 0.0059926 0.129216 0.0808808 -0.0277796 -0.0012925 -0.0425996 -0.0566926 -0.0000878 -0.0033241 0.000352 0.1602625 -0.1215909 -0.0406078 -0.0022694 -0.0267528 0.0695031 0.0030133 -0.0075247 0.001364 0.1550124 0.0474316 -0.0755317 0.0589472 0.0047795 -0.0751125 0.0907958 0.0017356 0.1135809 0.0476904 -0.1041552 -0.0059516 -0.0775089 -0.093959 0.0457681 -0.0502275 -0.100794 -0.0051285 0.0714849 0.040549 0.0660257 0.0254606 0.0791423 0.0357872 -0.0518385 0.0740632 -0.088574 -0.0977812 unknown
polarizability: 143.2670761|-7.9857004|129.7946334|-0.1245279|0.2336432|71.062537 unknown
InChI: InChI=1S/C10H13Cl/c1-7(2)9-6-8(3)4-5-10(9)11/h4-7H,1-3H3
charge 0 multiplicity 1
24 atoms
Cl 1.36563 -2.700419 0.014721
C  2.012515 0.448454 0.002055
C  0.544449 0.01287 0.000845
C  2.357324 1.260284 1.279201
C  2.36251 1.249299 -1.280666
C  -0.492188 0.985509 -0.009398
C  0.127945 -1.339604 0.004536
C  -1.867567 0.653476 -0.01246
C  -1.228657 -1.718846 -0.003293
C  -2.22369 -0.719395 -0.013614
C  -2.931901 1.737097 0.007961
H  2.634768 -0.464885 0.00718
H  1.774892 2.19912 1.328148
H  3.430215 1.527664 1.284626
H  2.141225 0.678213 2.192802
H  2.150131 0.659355 -2.190064
H  3.435398 1.516719 -1.283909
H  1.780233 2.187635 -1.340014
H  -0.206044 2.045283 -0.01616
H  -1.49981 -2.778656 -0.005576
H  -3.280049 -1.012321 -0.023336
H  -2.609419 2.633364 -0.550912
H  -3.879468 1.382205 -0.433437
H  -3.152242 2.059078 1.044465
