program: Gaussian 09
title: 000139879
version: EM64L-G09RevD.01
frameworkgroup: C1[X(C8H7ClO2)]
method: RPBEPBE
basis: SDD
operation: Freq
keyword: #p
keyword: freq=noraman
keyword: PBEPBE/SDD
title: #p freq=noraman PBEPBE/SDD
converged: YES YES NO NO
title: Mulliken charges:
elementType: Cl O O C C C C C C C C H H H H H H H
charge: 0.010024 -0.451875 -0.222327 0.535002 0.343293 -0.466275 -0.404419 -0.325174 -0.214271 -0.795816 0.112772 0.241851 0.290084 0.237686 0.250508 0.250430 0.221502 0.387006
chargesum: 0.00000
title: Mulliken charges with hydrogens summed into heavy atoms:
elementType: Cl O O C C C C C C C C
charge: 0.010024 -0.064870 -0.222327 0.535002 0.343293 -0.466275 -0.162568 -0.035090 0.023415 -0.073376 0.112772
polarizability: 1.31069488e+02 -2.83069612e+00 1.27097947e+02 9.92000978e-03 7.59833568e-02 4.46485493e+01
1716.lowfreq: -9.6157 -4.8788 -0.0021 0.0012 0.0022 5.2456 9.8351 81.4368 148.6611
frequency: 8.8294 81.4364 148.6606 194.3240 195.2903 244.3308 256.6969 330.9701 352.1939 450.9879 464.8213 488.9960 514.7912 567.0883 593.0169 611.0499 693.0504 746.5925 747.4238 812.0370 865.8473 932.3366 989.5706 997.1276 1027.7227 1050.2556 1050.7367 1110.7284 1172.5790 1197.3281 1261.4406 1308.2325 1368.8385 1403.5962 1412.2205 1444.6328 1460.3196 1476.8225 1581.5677 1597.2089 1651.9416 2988.6336 3069.1760 3097.8379 3133.6828 3159.5101 3192.8953 3533.0313
redmass: 12.6762 4.7395 1.0490 3.8174 9.4697 3.7794 5.3561 10.9305 4.9546 6.8841 3.3600 4.3446 3.3253 6.5891 1.2669 4.4376 4.7451 6.4578 2.4252 1.7207 5.3470 1.3642 1.9692 1.3609 4.2790 1.5484 2.6449 1.7895 1.3822 1.5824 1.8787 2.5210 7.0464 1.2755 3.0390 2.2713 1.0449 1.1688 5.3685 7.7258 8.9500 1.0369 1.0971 1.1000 1.0886 1.0943 1.0955 1.0642
irintensity: 0.6274 0.4096 0.7879 0.2921 1.1452 7.3529 0.8483 0.6008 5.9736 3.4180 1.9822 8.0177 5.8674 10.3140 133.2407 57.0046 25.5803 10.8721 47.0186 26.7434 37.8534 1.3510 65.8631 0.5485 61.9473 10.4942 243.2921 0.4562 24.3231 17.0036 1.3169 66.5197 10.3812 32.6427 50.2280 2.0188 15.2011 23.1286 3.2110 25.3486 253.0254 17.6703 11.8327 16.0423 8.7395 16.1174 3.3447 46.8132
temp: 298.150 k
press: 1.00000 atm
elementType: 17 8 8 6 6 6 6 6 6 6 6 1 1 1 1 1 1 1
symmnumber: 1
zpe: 341165.4 jmol-1
zpe.correction: 0.129943 hartree
zpe.thermalcorrener: 0.140217 hartree
zpe.thermalcorrenthalpy: 0.141161 hartree
zpe.thermalcorrgfe: 0.092079 hartree
zpe.sumelectzpe: -918.774758 hartree
zpe.sumelectthermal: -918.764485 hartree
zpe.sumelectthermalent: -918.763540 hartree
zpe.sumelectthermalfe: -918.812623 hartree
dipole: -1.5871 3.0266 0.0221
dipole: 3.4176
quadrupole: -57.2907 -70.8270 -72.5789
quadrupole: 2.3443 0.0793 -0.1737
quadrupole: 9.6082 -3.9282 -5.6800 2.3443 0.0793 -0.1737
hfenergy: -918.9047013 hartree
pointgroup: C01 [X(C8H7Cl1O2)]
dipole: -0.8101608 1.0715115 0.0581455 debye
dipolederiv: -0.0624994 0.0639001 0.0009873 0.0287506 -0.6973156 -0.0094805 0.0007013 -0.0093161 -0.0316715 -0.9196342 -0.514776 -0.0054035 -0.5912731 -0.7618312 0.005081 -0.0118554 0.0040156 -0.4338653 -0.8481744 0.2599374 0.0311845 0.1889483 -0.7736832 -0.0304462 0.0244387 -0.0312709 -0.3118004 0.071653 0.3897766 0.003381 0.3683847 -0.1919501 -0.0168948 0.002447 -0.0178455 0.0225557 -0.7174967 0.0900413 0.0308707 0.159534 -0.2307539 -0.0124665 0.0322823 -0.0092792 0.0594766 0.2022316 -0.3927068 -0.0167353 0.0457048 0.98501 0.0105771 -0.0070547 0.0270728 -0.097726 0.0858142 0.0249667 -0.0083684 -0.1189046 0.1015862 0.008324 -0.010404 0.0025203 -0.1491104 0.0972515 0.0304942 -0.0075254 -0.1784446 -0.0512539 0.0078503 -0.0144473 0.0012057 -0.129775 -0.2093478 -0.1505983 0.0003005 -0.0716696 0.100634 0.0065313 0.0010545 0.0099341 -0.1464384 0.0224605 -0.1151286 -0.000695 -0.1751415 -0.0918854 0.0046882 -0.0007225 0.003338 0.0414196 1.9526759 0.1458563 -0.0565496 0.0773819 1.2593589 0.0486955 -0.0524525 0.0394145 0.2348877 -0.0962005 0.0566238 0.0100088 0.0321067 0.0729179 -0.0023026 0.0096886 -0.0034015 0.1496438 0.0852132 -0.0509881 0.0024955 -0.0613582 0.0462628 0.0007859 0.0035102 -0.0006782 0.1647431 0.0699499 0.0398618 0.0041034 0.0468325 -0.0992728 -0.0057864 0.0045315 -0.0053719 0.1620202 0.0615624 -0.0120794 0.036476 -0.0469699 0.0314567 -0.0911452 -0.0191251 -0.0967967 -0.0251308 0.0596684 -0.0048974 -0.042124 -0.0410112 0.0267456 0.0955841 0.012121 0.0987038 -0.0196305 -0.096923 0.0435349 0.007648 0.1578645 0.0315271 -0.0064233 0.0091403 -0.0026211 0.1115472 0.2417956 0.0961815 0.0099454 0.1792648 0.2424468 -0.013172 0.0161462 -0.0096238 0.3988545 unknown
polarizability: 131.7510277|-1.9745919|126.2597942|-3.3592309|1.5637665|44.805162 unknown
InChI: InChI=1S/C8H7ClO2/c1-5-3-2-4-6(7(5)9)8(10)11/h2-4,10H,1H3
charge 0 multiplicity 1
18 atoms
Cl -0.115211 -2.502879 -0.10415
O  2.890482 1.010865 -0.14028
O  2.566784 -1.27755 -0.226276
C  -1.807127 -0.324299 -0.011318
C  0.618454 0.239351 -0.094616
C  -0.441147 -0.711878 -0.068734
C  -2.094499 1.063273 0.019882
C  0.275526 1.621635 -0.059613
C  -1.066724 2.030769 -0.00338
C  -2.930694 -1.3399 0.01661
C  2.062271 -0.134709 -0.159602
H  -3.143103 1.379097 0.063423
H  1.087351 2.351574 -0.078425
H  -1.314028 3.096648 0.022299
H  -2.908323 -1.989379 -0.877195
H  -2.846866 -2.008703 0.892427
H  -3.909839 -0.834598 0.056406
H  3.834792 0.702883 -0.188259
