program: Gaussian 09
title: 000139878
version: EM64L-G09RevD.01
frameworkgroup: C1[X(C7H20Si2)]
method: RPBEPBE
basis: SDD
operation: Freq
keyword: #pfreq=noraman
keyword: PBEPBE/SDD
title: #p freq=noraman PBEPBE/SDD
converged: YES YES NO NO
title: Mulliken charges:
elementType: Si Si C C C C C C C H H H H H H H H H H H H H H H H H H H H
charge: 0.853770 0.892606 -0.692024 -1.011024 -1.009729 -0.997499 -0.998708 -0.998442 -0.669742 0.223010 0.223196 0.238018 0.235668 0.234045 0.233748 0.235888 0.237504 0.234643 0.236222 0.234326 0.236690 0.234576 0.234671 0.234197 0.234906 0.236688 0.218866 0.216522 0.217408
chargesum: 0.00000
title: Mulliken charges with hydrogens summed into heavy atoms:
elementType: Si Si C C C C C C C
charge: 0.853770 0.892606 -0.245818 -0.303293 -0.302590 -0.292308 -0.292771 -0.292651 -0.016946
polarizability: 1.44393685e+02 9.38342482e-03 1.23321054e+02 1.58848803e-02 -4.08042782e-03 1.22193342e+02
1716.lowfreq: -31.7485 -21.3298 -15.0770 -9.2915 -0.0019 0.0007 0.0010 42.7440 58.6726
frequency: -20.5819 41.4956 58.0194 74.6901 119.7403 125.2720 135.6597 142.4159 148.3440 150.5814 157.9649 162.0997 173.3022 185.3262 203.4244 211.0552 225.6684 244.2548 284.0682 405.4483 572.4154 604.7005 665.0635 670.8409 683.2754 685.2184 700.3060 738.6298 774.9590 791.2854 804.7213 816.7724 862.6148 891.6754 898.8166 899.1681 921.6830 979.2569 983.3545 1018.5523 1233.4642 1235.0650 1284.6533 1285.1961 1288.5721 1293.0358 1301.4802 1385.6444 1438.7230 1441.1423 1442.6725 1445.3328 1445.6815 1448.9528 1453.3939 1455.4116 1455.7109 1458.1991 1462.4206 1480.9780 1481.7155 2968.7702 2972.8187 2974.1249 2974.2397 2974.7273 2974.8578 2975.8328 3023.9751 3057.8672 3069.9181 3073.9795 3074.1317 3074.7931 3076.0601 3076.3495 3080.9910 3081.7938 3081.8709 3082.8613 3083.0870
redmass: 2.6980 2.1093 3.1146 2.3556 1.0674 1.0214 1.8868 1.2153 1.0604 1.0582 2.5922 1.5964 2.0834 2.6058 2.5473 2.2775 3.1237 1.8704 3.3670 3.9510 3.9606 4.1053 1.7799 3.9639 3.6718 3.3910 1.8193 1.1654 1.2625 1.2806 1.3758 1.2418 1.4058 1.4207 1.4390 1.4431 1.5026 1.2479 1.4187 2.8671 1.3984 1.2321 1.1974 1.1969 1.1940 1.1903 1.1833 1.1875 1.0744 1.0556 1.0554 1.0545 1.0553 1.0530 1.0518 1.0500 1.0507 1.0513 1.0482 1.0468 1.0436 1.0407 1.0516 1.0339 1.0339 1.0338 1.0338 1.0345 1.0996 1.0996 1.0999 1.0986 1.0986 1.0984 1.0977 1.0974 1.0985 1.0980 1.0986 1.0980 1.0980
irintensity: 0.0005 0.0096 0.1599 0.3378 0.0291 0.0068 0.1888 0.0309 0.0437 0.0085 0.0317 0.1083 0.1760 2.2681 4.2342 0.7031 0.0181 0.1227 11.0712 4.3061 9.8249 2.7740 0.0360 13.4209 12.5410 6.2298 17.0355 0.0343 18.0977 6.6878 6.1262 19.6342 203.8489 59.1131 67.5321 92.0475 83.2502 8.4047 9.3673 33.3523 2.5881 2.1330 8.4593 32.0587 69.1404 31.8245 6.1599 7.4944 7.3096 1.1795 2.9927 0.1851 2.4701 9.1503 10.3748 17.3305 9.9763 5.8729 16.5238 6.5215 10.2889 52.1479 23.4727 22.1572 25.8549 24.1544 24.2070 5.3032 6.4186 46.4547 45.4928 1.6747 3.2451 2.5630 52.4737 40.4811 11.4056 21.7836 5.5844 25.7895 26.1269
temp: 298.150 k
press: 1.00000 atm
elementType: 14 14 6 6 6 6 6 6 6 1 1 1 1 1 1 1 1 1 1 1 1 1 1 1 1 1 1 1 1
symmnumber: 1
zpe: 653057.2 jmol-1
zpe.correction: 0.248736 hartree
zpe.thermalcorrener: 0.265237 hartree
zpe.thermalcorrenthalpy: 0.266181 hartree
zpe.thermalcorrgfe: 0.205456 hartree
zpe.sumelectzpe: -856.782069 hartree
zpe.sumelectthermal: -856.765568 hartree
zpe.sumelectthermalent: -856.764624 hartree
zpe.sumelectthermalfe: -856.825349 hartree
dipole: 0.0472 -0.0861 -0.0026
dipole: 0.0982
quadrupole: -75.3280 -76.0437 -76.2770
quadrupole: -0.0830 -0.0078 0.0063
quadrupole: 0.5549 -0.1608 -0.3941 -0.0830 -0.0078 0.0063
hfenergy: -857.030805 hartree
pointgroup: C01 [X(C7H20Si2)]
dipole: 0.0202901 -0.0328372 -0.0019596 debye
polarizability: 144.3368925|1.0923763|123.3772453|-0.0269466|0.0245953|122.1939434 unknown
InChI: InChI=1S/C4H11Si.C3H9Si/c1-4-5(2)3;1-4(2)3/h4H2,1-3H3;1-3H3
charge 0 multiplicity 1
29 atoms
Si 0.738591 0.430889 0.009573
Si -1.575229 -0.246018 -0.00073
C  1.880293 -1.128751 -0.062846
C  1.113435 1.423768 1.614757
C  1.09108 1.551571 -1.514855
C  -2.708109 1.308184 0.030835
C  -1.959418 -1.265686 -1.586025
C  -1.950534 -1.323951 1.547933
C  3.396431 -0.803243 -0.033743
H  1.623211 -1.793943 0.786686
H  1.636959 -1.698052 -0.983121
H  2.168009 1.75851 1.636902
H  0.47385 2.323241 1.683047
H  0.93165 0.80939 2.516101
H  0.886761 1.015836 -2.460468
H  0.457197 2.457369 -1.494229
H  2.147622 1.880683 -1.530807
H  -2.528655 1.951288 -0.850606
H  -3.774958 1.013246 0.024764
H  -2.529255 1.915822 0.937192
H  -3.026067 -1.56028 -1.611091
H  -1.747908 -0.679294 -2.499293
H  -1.351724 -2.188564 -1.626388
H  -1.343327 -2.248051 1.550338
H  -1.732319 -0.771327 2.480541
H  -3.017193 -1.61881 1.569429
H  4.008465 -1.723763 -0.085811
H  3.687237 -0.162858 -0.887494
H  3.676307 -0.270803 0.89451
