program: Gaussian 09
title: 000139861
version: EM64L-G09RevD.01
frameworkgroup: C1[X(C9H17NO)]
method: RPBEPBE
basis: SDD
operation: Freq
keyword: #p
keyword: freq=noraman
keyword: PBEPBE/SDD
title: #p freq=noraman PBEPBE/SDD
converged: YES YES NO NO
title: Mulliken charges:
elementType: O N C C C C C C C C C H H H H H H H H H H H H H H H H H
charge: -0.279444 -0.631701 -0.358360 -0.353550 -0.377448 -0.354407 -0.469803 -0.694842 -0.075378 -0.367488 0.227599 0.188287 0.190377 0.189844 0.189880 0.203790 0.211130 0.195424 0.194261 0.206663 0.208388 0.210055 0.210746 0.215806 0.265868 0.214113 0.332070 0.308122
chargesum: 0.00000
title: Mulliken charges with hydrogens summed into heavy atoms:
elementType: O N C C C C C C C C C
charge: -0.279444 0.008492 0.020304 0.026174 0.037472 0.035277 -0.054752 -0.058235 0.190490 -0.153376 0.227599
polarizability: 1.60608084e+02 -1.41067747e+00 9.39690873e+01 1.30974773e+01 -7.79228064e+00 8.52808389e+01
1716.lowfreq: -12.1656 0.0003 0.0004 0.0008 6.3552 7.7260 26.3393 38.8240 48.1292
frequency: 26.2521 38.5847 48.1147 70.9160 109.5935 123.1058 130.5778 151.6715 191.2931 228.6966 231.3787 271.8118 377.8768 405.2441 450.7629 473.0830 488.6180 566.8799 616.3121 698.0631 721.5724 735.6621 782.9376 845.6027 871.9208 889.4747 906.4631 972.0108 992.4039 1001.8239 1018.2223 1038.2808 1050.0396 1067.7955 1079.6444 1113.3073 1140.7427 1190.4673 1219.1292 1232.4202 1254.1980 1270.6538 1283.0097 1287.4566 1291.4747 1295.8841 1320.4347 1345.6345 1354.7432 1365.8109 1389.4133 1456.6908 1462.0903 1465.4349 1473.2065 1477.5120 1481.4784 1487.9744 1583.0405 1626.2948 1672.9996 2950.9961 2954.0664 2955.8348 2966.7153 2971.9369 2973.6712 2988.0169 3002.3128 3014.5754 3029.3853 3047.0531 3068.3246 3071.3646 3090.3944 3098.9282 3522.2002 3679.4899
redmass: 3.5915 1.9179 4.4157 2.8529 1.8225 3.9529 2.1779 2.4958 3.3968 2.3322 1.3092 2.9562 3.3039 3.0476 2.7189 1.3654 2.1543 1.2403 3.8697 3.1224 1.0644 1.1195 1.2515 1.6589 2.0212 1.8223 1.7852 1.4085 1.2280 2.8554 2.5962 2.4116 1.6748 2.3000 2.2421 2.2471 1.9868 1.6467 1.3009 1.3628 1.3466 1.2359 1.2150 1.2267 1.1563 1.1529 1.4398 1.5281 1.6597 2.5581 1.2163 1.0925 1.0666 1.0785 1.0760 1.0428 1.0822 1.0884 2.1670 2.0006 6.2760 1.0590 1.0611 1.0588 1.0592 1.0369 1.0593 1.0973 1.0997 1.0991 1.1038 1.1042 1.1007 1.0993 1.0933 1.0885 1.0445 1.1044
irintensity: 4.2974 0.7722 3.1408 2.6081 0.8573 0.9137 1.0152 2.0118 4.9766 0.3937 0.2037 0.4855 4.3731 1.3945 5.0494 124.1569 62.4343 98.5758 8.8942 33.4243 12.6690 1.4927 6.4506 9.7770 11.7701 3.2772 1.4015 17.0633 33.1815 1.6387 7.2367 12.9648 5.8690 7.6693 0.0763 16.5231 3.3119 0.8374 2.7324 15.1374 16.5479 16.5412 16.1114 8.6684 0.2841 8.1866 13.2825 16.9840 1.0221 148.1492 11.2085 4.4739 0.2258 1.7182 1.2192 12.2725 4.8887 23.1084 152.8432 189.7156 119.7676 0.7580 16.6530 8.9475 47.6639 30.8696 105.7108 1.0801 2.1465 6.3914 12.8431 106.2185 96.5695 54.6653 0.3491 27.7926 43.4737 23.9562
temp: 298.150 k
press: 1.00000 atm
elementType: 8 7 6 6 6 6 6 6 6 6 6 1 1 1 1 1 1 1 1 1 1 1 1 1 1 1 1 1
symmnumber: 1
zpe: 643587.7 jmol-1
zpe.correction: 0.245130 hartree
zpe.thermalcorrener: 0.258992 hartree
zpe.thermalcorrenthalpy: 0.259936 hartree
zpe.thermalcorrgfe: 0.202592 hartree
zpe.sumelectzpe: -482.244218 hartree
zpe.sumelectthermal: -482.230355 hartree
zpe.sumelectthermalent: -482.229411 hartree
zpe.sumelectthermalfe: -482.286755 hartree
dipole: -0.9992 -3.4364 1.7058
dipole: 3.9645
quadrupole: -65.3770 -71.2526 -67.8876
quadrupole: -14.5363 11.6590 -1.7767
quadrupole: 2.7954 -3.0802 0.2848 -14.5363 11.6590 -1.7767
hfenergy: -482.4893472 hartree
pointgroup: C01 [X(C9H17N1O1)]
dipole: -0.4073571 -1.1735056 0.9432802 debye
polarizability: 160.5153964|0.8532898|90.2922849|13.3228042|-9.0048286|89.0503286 unknown
InChI: InChI=1S/C9H17NO/c1-2-3-4-5-6-7-8-9(10)11/h7-8H,2-6,10H2,1H3
charge 0 multiplicity 1
28 atoms
O  4.145975 1.202743 -0.637913
N  4.975223 -0.231639 0.988457
C  -2.289243 -0.562165 -0.221626
C  -3.445157 0.396718 0.142016
C  -0.898545 0.10647 -0.146378
C  -4.837978 -0.268831 0.057706
C  0.255595 -0.874881 -0.496109
C  -5.98828 0.69231 0.427454
C  1.602296 -0.198668 -0.517122
C  2.673473 -0.532235 0.252401
C  3.961869 0.221688 0.148191
H  -2.449666 -0.958857 -1.246251
H  -2.313327 -1.439503 0.458512
H  -3.28928 0.789168 1.168654
H  -3.419601 1.277326 -0.533572
H  -0.865751 0.971369 -0.84004
H  -0.733169 0.51463 0.870525
H  -4.994186 -0.657385 -0.969457
H  -4.86093 -1.150995 0.730049
H  0.048845 -1.301453 -1.501136
H  0.255797 -1.721154 0.218296
H  -5.870201 1.072962 1.459651
H  -6.008529 1.566436 -0.250673
H  -6.97198 0.19188 0.362385
H  1.733929 0.649147 -1.208054
H  2.610977 -1.366394 0.966023
H  5.875971 0.244534 0.958883
H  4.846472 -1.016524 1.624027
