program: Gaussian 09
title: 000139845
version: EM64L-G09RevD.01
frameworkgroup: C1[X(C10H14S)]
method: RPBEPBE
basis: SDD
operation: Freq
keyword: #pfreq=noraman
keyword: PBEPBE/SDD
title: #p freq=noraman PBEPBE/SDD
converged: YES YES NO NO
title: Mulliken charges:
elementType: S C C C C C C C C C C H H H H H H H H H H H H H H
charge: 0.153341 -0.349202 -0.158763 -0.623192 -0.659347 0.452167 -0.378415 -0.285042 -0.397714 -0.203442 -0.806937 0.259531 0.206602 0.244089 0.221682 0.214351 0.234172 0.224243 0.248909 0.256068 0.232275 0.226947 0.225165 0.238507 0.224004
chargesum: 0.00000
title: Mulliken charges with hydrogens summed into heavy atoms:
elementType: S C C C C C C C C C C
charge: 0.153341 -0.089671 -0.158763 0.049181 0.013419 0.452167 -0.129506 -0.028974 -0.165440 0.023506 -0.119261
polarizability: 1.68540584e+02 3.44588489e+00 1.21481828e+02 -7.18020251e+00 -9.44913733e-01 8.57136635e+01
1716.lowfreq: -39.3471 -10.6443 -4.1904 -0.0030 -0.0027 -0.0020 7.6575 20.4516 44.7742
frequency: -38.1001 20.1272 44.7518 72.0217 188.8027 210.8764 212.0066 223.8690 248.7237 272.3131 331.6723 368.3429 385.4716 422.9313 445.7545 511.6346 532.0401 582.1231 669.7498 697.0850 791.1322 837.7433 882.3451 893.7284 917.6642 924.3097 951.3831 982.7572 985.7236 989.5396 1047.1134 1054.3584 1072.7859 1100.3897 1135.4547 1161.8585 1176.9454 1219.7697 1243.4003 1290.4406 1316.1041 1369.7096 1379.5732 1395.6393 1397.4824 1404.0208 1458.6596 1460.9106 1464.9803 1472.1033 1473.4608 1474.8612 1484.0719 1578.6660 1601.8694 2971.2501 2976.2236 2979.7912 3025.9314 3057.8737 3064.5106 3074.4603 3085.6144 3087.0063 3092.6563 3120.4604 3125.2647 3141.0458 3162.3313
redmass: 1.0138 3.6353 2.9019 3.7231 3.8771 3.1487 1.0775 2.5864 1.3558 2.6922 2.8784 2.9971 2.8426 3.6195 3.5983 4.8718 4.0327 3.7465 6.8268 2.3373 1.3742 4.9446 2.6258 1.3247 1.3647 1.1570 1.3793 1.5409 3.0258 1.6085 1.5634 1.3289 2.1817 1.4851 2.3591 1.9107 1.0980 2.5283 1.2673 1.3184 1.4187 8.4697 1.2200 1.2083 1.2225 2.5193 1.0479 2.2592 1.0463 1.0554 1.0466 1.1466 1.0465 5.8292 6.3220 1.0368 1.0384 1.0355 1.0862 1.0953 1.0974 1.0986 1.0998 1.1004 1.0999 1.0871 1.0915 1.0925 1.0983
irintensity: 0.5795 0.5778 0.2840 0.5248 2.7046 1.0377 0.1074 0.3658 0.3937 0.6880 0.5660 1.0216 0.7727 1.2823 7.1160 1.0536 0.9637 6.6957 2.2600 23.9368 47.1220 13.4925 2.7628 2.5720 1.8833 4.1915 0.1499 0.8211 3.7099 0.5932 17.5767 28.1997 12.3502 2.8209 2.0359 31.5584 0.6437 1.9628 26.9481 0.6327 1.2834 0.5987 23.7393 16.3156 12.2037 3.9187 6.1579 18.6683 2.1000 13.6774 8.1279 26.1249 14.0987 15.2269 26.3936 31.3517 33.7532 38.3964 5.5312 21.0164 12.3159 42.6997 17.9025 18.8279 38.2739 6.6572 11.0423 20.9808 15.2429
temp: 298.150 k
press: 1.00000 atm
elementType: 16 6 6 6 6 6 6 6 6 6 6 1 1 1 1 1 1 1 1 1 1 1 1 1 1
symmnumber: 1
zpe: 549060.1 jmol-1
zpe.correction: 0.209126 hartree
zpe.thermalcorrener: 0.220887 hartree
zpe.thermalcorrenthalpy: 0.221831 hartree
zpe.thermalcorrgfe: 0.170010 hartree
zpe.sumelectzpe: -786.692382 hartree
zpe.sumelectthermal: -786.680621 hartree
zpe.sumelectthermalent: -786.679677 hartree
zpe.sumelectthermalfe: -786.731498 hartree
dipole: -0.6534 1.1378 1.7207
dipole: 2.1639
quadrupole: -66.1671 -69.2516 -79.2132
quadrupole: 1.1143 1.2596 -1.0424
quadrupole: 5.3768 2.2924 -7.6693 1.1143 1.2596 -1.0424
hfenergy: -786.9015082 hartree
pointgroup: C01 [X(C10H14S1)]
dipole: -0.2269815 -0.5306942 -0.6258047 debye
dipolederiv: -0.3690225 0.0590826 0.0950851 0.1945774 -0.1590926 0.0457393 0.0869007 0.0561097 -0.1721539 0.3211213 -0.1303083 -0.1991111 -0.3246712 0.1978273 0.0694137 -0.3401508 0.0513095 0.3212557 0.6353642 0.0057639 0.0834647 -0.0025688 0.0161194 -0.0909972 0.1840939 -0.0654358 -0.0992317 -0.0788324 0.0480807 0.0034148 0.1312217 0.0144295 0.0118952 0.0394219 0.0754892 -0.1246938 -0.1065287 0.0328975 -0.0539143 0.1319029 0.0447581 0.0147368 0.137686 -0.0184535 -0.0103116 0.1345182 0.2137623 -0.0148743 0.1791847 0.2855989 -0.0352943 -0.0402805 -0.0607094 -0.0138196 -0.3176388 -0.1726979 0.0386588 -0.067093 -0.0820871 -0.045162 -0.0802616 -0.064139 -0.1206104 -0.3242924 0.0976273 -0.0144235 0.0131982 -0.0256822 -0.0022497 -0.0074062 0.00084 -0.1370303 0.009616 0.0116772 0.0799931 -0.0964755 -0.1789583 -0.0145746 0.0774048 0.0139994 -0.1572244 0.0466609 -0.068799 0.0709442 0.0121017 0.0877492 -0.0476111 0.0809983 -0.0595716 -0.0929668 -0.0180363 -0.1139755 0.015529 -0.0809673 -0.0779474 0.0135821 0.0653432 0.0847753 0.0648353 -0.0352025 -0.0757733 0.0161005 -0.0537287 -0.1075421 -0.026369 0.0301804 -0.0205154 -0.0193721 0.0339632 0.0620595 0.1090052 0.0674741 0.0114688 -0.0968703 0.1561004 -0.0860184 -0.0927638 -0.077541 0.0413919 -0.1022632 0.0299673 0.063166 0.0373037 -0.098397 0.0157345 0.0707486 0.033585 -0.1006208 0.010501 -0.1142408 -0.0699388 0.0255354 -0.0455256 -0.0398765 0.0777387 -0.0697304 0.0802484 0.0699355 0.10646 0.0301592 -0.0856503 0.1013784 -0.1041722 -0.0136326 0.104986 -0.0108238 0.0063774 -0.0008687 0.0381122 0.1027022 -0.0572244 0.1208487 -0.0885497 0.0468658 -0.0519299 -0.0139931 -0.1480229 -0.0842184 -0.0267216 -0.0395335 -0.0025373 0.0963525 0.0743295 0.0748461 -0.0498455 0.064944 -0.0281566 0.0487657 -0.0446121 0.0427735 0.1092127 0.0685942 -0.0941109 -0.0163757 -0.0761599 -0.0166483 0.0208425 -0.0171506 0.0137682 0.1367264 -0.1144066 -0.0137598 -0.0771229 -0.0366627 0.0878573 -0.0017027 -0.0890892 0.0022455 0.1263227 0.0178245 0.0802135 -0.04951 0.0845089 -0.0659428 0.0650607 -0.067793 0.0682962 0.1237279 -0.0020501 0.1401729 0.0282103 0.0445351 -0.07101 -0.0281092 -0.0011988 -0.0382543 0.1007821 0.032076 -0.0674213 0.080721 -0.0637409 0.0314994 0.0147869 0.1139937 0.0551936 -0.0793685 -0.0462232 -0.0476031 -0.116507 0.0051244 0.0584793 0.0309478 -0.1448784 -0.0416999 -0.0059733 unknown
polarizability: 168.6707797|0.0234577|120.7291497|7.8530999|-4.2782316|86.3361455 unknown
InChI: InChI=1S/C10H14S/c1-8(2)11-10-6-4-5-9(3)7-10/h4-8H,1-3H3
charge 0 multiplicity 1
25 atoms
S  1.709225 0.579669 1.07434
C  2.612074 -0.4539 -0.282741
C  -0.033265 0.469652 0.474373
C  2.571146 0.270098 -1.636266
C  4.040113 -0.701319 0.231994
C  -2.071701 -0.857591 0.071167
C  -0.723286 -0.765368 0.501395
C  -0.690476 1.640407 0.028372
C  -2.720497 0.323523 -0.375736
C  -2.039335 1.561218 -0.389164
C  -2.81499 -2.181858 0.129637
H  2.053523 -1.405692 -0.337783
H  3.049635 -0.353846 -2.417026
H  1.532829 0.476005 -1.95001
H  3.113312 1.23136 -1.579527
H  4.606419 -1.299559 -0.506435
H  4.035986 -1.246112 1.192333
H  4.578125 0.253692 0.377351
H  -0.211053 -1.660074 0.876116
H  -0.149565 2.591774 0.005657
H  -3.763778 0.271699 -0.710545
H  -2.55325 2.46499 -0.735767
H  -2.137027 -3.036896 -0.039661
H  -3.286593 -2.328103 1.120859
H  -3.618873 -2.227568 -0.626033
