program: Gaussian 09
title: 000139840
version: EM64L-G09RevD.01
frameworkgroup: C1[X(H12Si5)]
method: RPBEPBE
basis: SDD
operation: Freq
keyword: #p
keyword: freq=noraman
keyword: PBEPBE/SDD
title: #p freq=noraman PBEPBE/SDD
converged: YES YES NO NO
title: Mulliken charges:
elementType: Si Si Si Si Si H H H H H H H H H H H H
charge: 0.042496 -0.002252 -0.002385 0.157342 0.157470 -0.019380 -0.019364 -0.019150 -0.021609 -0.019162 -0.021636 -0.038565 -0.037687 -0.039927 -0.039927 -0.037684 -0.038580
chargesum: 0.00000
title: Mulliken charges with hydrogens summed into heavy atoms:
elementType: Si Si Si Si Si
charge: 0.003751 -0.043011 -0.043182 0.041163 0.041279
polarizability: 1.56922373e+02 1.09410419e-02 1.33535399e+02 -7.83319686e-01 -1.78537563e-02 1.22877659e+02
1716.lowfreq: -0.0027 -0.0023 -0.0013 6.2561 8.6417 15.4747 19.0591 44.1188 66.6190
frequency: 15.2757 43.6296 66.5674 84.8512 90.2505 104.8302 140.3850 298.6248 327.6165 346.7972 363.9378 384.0208 418.1637 445.3437 467.7125 474.1362 512.7529 520.0560 619.2507 629.5721 647.9865 683.6213 714.3499 714.8471 815.5344 818.3239 865.8114 874.8642 884.3829 903.1417 904.2951 907.3371 908.6595 2109.3142 2113.7633 2116.3414 2125.4763 2127.3084 2130.1287 2132.5529 2136.7011 2148.8848 2149.3600 2151.7788 2153.3567
redmass: 4.7823 2.4601 4.0740 1.0486 1.1839 3.2113 3.8515 1.0987 1.9153 1.9672 1.8922 1.8745 5.6840 4.4387 1.1070 1.2284 1.2925 1.3359 1.1234 1.1505 1.1341 1.0844 1.0972 1.1136 1.0942 1.0962 1.0373 1.0406 1.0457 1.0292 1.0295 1.0328 1.0342 1.0293 1.0301 1.0288 1.0194 1.0214 1.0502 1.0499 1.0511 1.0506 1.0508 1.0510 1.0512
irintensity: 0.0023 0.0190 0.0632 0.0057 0.0538 1.4475 0.9423 12.2047 1.4642 2.3954 0.4678 3.1254 0.0020 0.4355 11.6831 3.1375 0.2097 5.5876 1.4478 252.6140 158.5402 30.2577 97.2422 26.0506 122.3465 198.7881 38.1631 76.1531 18.2590 31.5391 29.1965 76.3440 8.0963 26.8003 93.3269 57.3323 57.0991 16.7037 29.4125 41.2932 67.9019 174.1224 13.7090 92.2898 95.5700
temp: 298.150 k
press: 1.00000 atm
elementType: 14 14 14 14 14 1 1 1 1 1 1 1 1 1 1 1 1
symmnumber: 1
zpe: 254756.1 jmol-1
zpe.correction: 0.097031 hartree
zpe.thermalcorrener: 0.109952 hartree
zpe.thermalcorrenthalpy: 0.110896 hartree
zpe.thermalcorrgfe: 0.056050 hartree
zpe.sumelectzpe: -1453.604759 hartree
zpe.sumelectthermal: -1453.591839 hartree
zpe.sumelectthermalent: -1453.590895 hartree
zpe.sumelectthermalfe: -1453.645741 hartree
dipole: -0.0006 -0.0190 -0.0001
dipole: 0.0190
quadrupole: -76.9217 -77.4993 -77.7562
quadrupole: -0.0005 0.0243 0.0023
quadrupole: 0.4707 -0.1069 -0.3638 -0.0005 0.0243 0.0023
hfenergy: -1453.7017908 hartree
pointgroup: C01 [X(H12Si5)]
dipole: -0.0002453 -0.0074862 -0.0000765 debye
dipolederiv: 0.5735107 -0.0000332 -0.0564195 0.0032032 0.4960062 0.0017668 -0.3480019 0.002062 0.281273 0.4961545 -0.0917236 -0.0348601 -0.2776409 0.3816782 0.0101913 -0.0340013 -0.0593065 0.4417059 0.4965252 0.0922995 -0.0326319 0.2781209 0.3800404 -0.011476 -0.028377 0.0578716 0.4428738 0.6142326 -0.0874168 0.0792838 -0.1503115 0.6122588 -0.0794467 0.2407564 -0.1892095 0.5883257 0.6157314 0.0864646 0.0813672 0.1457092 0.6062995 0.0792789 0.2448764 0.1888665 0.593231 -0.2589926 0.0577431 0.0035173 0.0538018 -0.2670468 0.0570955 0.0741025 0.0200548 -0.1489132 -0.259175 -0.0574178 0.0026564 -0.0551198 -0.2657674 -0.0590815 0.0733619 -0.0221556 -0.1501574 -0.2832211 0.0013542 0.0595816 0.075221 -0.1797253 0.0241489 0.0887396 0.0678802 -0.208242 -0.2067452 0.0348395 -0.0132517 0.0639357 -0.1744787 -0.0157044 -0.0140232 -0.0175159 -0.2426685 -0.2829145 -0.0027038 0.0592488 -0.0769908 -0.1776253 -0.0237241 0.0872111 -0.0674052 -0.2105988 -0.2071787 -0.0343245 -0.0143259 -0.063365 -0.1749875 0.0172158 -0.0157334 0.0190954 -0.241682 -0.2059913 0.0187855 -0.0572307 0.0318213 -0.1630963 0.0152535 -0.0916796 0.0136016 -0.228022 -0.2576263 0.0912025 -0.0033093 0.1359427 -0.2357917 0.004141 -0.0807346 0.0598813 -0.1564005 -0.1845868 0.0045708 -0.0052878 0.0110704 -0.2220284 0.0566429 -0.0099374 0.0736162 -0.1861208 -0.1845663 -0.0048045 -0.0054351 -0.011218 -0.2189559 -0.0574066 -0.0103479 -0.0743245 -0.1891488 -0.2580982 -0.0913247 -0.0049652 -0.1342906 -0.2343014 -0.0052492 -0.0834155 -0.0610071 -0.1575941 -0.2070583 -0.0175107 -0.0579379 -0.0298895 -0.1624783 -0.0136461 -0.0927961 -0.0120053 -0.2278611 unknown
polarizability: 156.9213058|-0.0026088|133.5351629|-0.8062686|0.0527373|122.8789617 unknown
InChI: InChI=1S/2H3Si.3H2Si/h2*1H3;3*1H2
charge 0 multiplicity 1
17 atoms
Si 0.000998 1.680523 0.014201
Si 1.676191 0.331385 -1.004948
Si -1.672681 0.3138 1.012097
Si 2.659154 -1.134604 0.585575
Si -2.665622 -1.116206 -0.604693
H  -0.637134 2.575604 -1.019854
H  0.638367 2.559306 1.062631
H  2.738134 1.206175 -1.624457
H  1.045445 -0.48258 -2.107841
H  -2.730032 1.177302 1.654827
H  -1.038253 -0.524324 2.09462
H  3.265853 -0.341792 1.712728
H  3.733681 -1.977704 -0.049356
H  1.603178 -2.045052 1.154887
H  -1.613032 -2.012665 -1.201772
H  -3.735481 -1.974312 0.017865
H  -3.280266 -0.298158 -1.709309
