program: Gaussian 09
title: 000139826
version: EM64L-G09RevD.01
frameworkgroup: C1[X(C6H8)]
method: RPBEPBE
basis: SDD
operation: Freq
keyword: #p
keyword: freq=noraman
keyword: PBEPBE/SDD
title: #p freq=noraman PBEPBE/SDD
converged: YES YES NO NO
title: Mulliken charges:
elementType: C C C C C C H H H H H H H H
charge: 0.525794 -0.793056 -0.384514 -0.724406 0.171448 -0.606443 0.229746 0.223867 0.229724 0.225729 0.219260 0.218184 0.232281 0.232388
chargesum: 0.00000
title: Mulliken charges with hydrogens summed into heavy atoms:
elementType: C C C C C C
charge: 0.525794 -0.109719 -0.158785 -0.286963 0.171448 -0.141774
polarizability: 1.20699941e+02 1.66178770e+01 5.55220014e+01 -9.25170227e-03 -6.12938436e-03 3.58537813e+01
1716.lowfreq: -0.0009 -0.0007 -0.0002 10.4399 14.4443 15.6831 105.6504 139.8486 168.1441
frequency: 105.6478 139.8416 168.1341 326.5895 353.5947 401.6824 404.1963 577.2910 597.4406 731.0590 815.3842 878.6307 902.8949 950.7942 962.4355 991.4783 1017.2019 1051.7081 1101.5365 1293.6117 1331.8975 1396.4031 1423.6705 1445.5823 1461.8252 1478.6894 1640.2030 1981.0158 2979.1013 3057.4717 3066.2526 3078.6893 3095.4212 3096.9904 3155.4942 3201.2607
redmass: 2.1100 3.2688 1.1522 2.0520 3.6871 2.3452 1.8061 4.3032 1.3913 1.1949 4.0683 1.3040 1.2141 1.3336 1.6136 1.4778 1.4845 1.5356 1.7962 1.4951 2.9839 1.2474 1.2406 1.3320 1.0451 1.0886 4.4618 10.0180 1.0368 1.0969 1.0604 1.0876 1.0926 1.0688 1.1124 1.1139
irintensity: 0.1002 0.4884 1.6501 9.8067 6.2401 1.2878 5.8265 5.5370 1.8824 0.6746 0.3610 91.8906 4.4428 101.8543 0.1614 1.9609 2.1419 9.0894 6.4525 5.7839 6.0045 20.1674 1.7699 3.8974 16.2149 20.4859 22.8129 51.6270 18.6902 21.9953 7.7831 9.0225 24.7137 5.2444 6.8143 19.5662
temp: 298.150 k
press: 1.00000 atm
elementType: 6 6 6 6 6 6 1 1 1 1 1 1 1 1
symmnumber: 1
zpe: 303020.8 jmol-1
zpe.correction: 0.115415 hartree
zpe.thermalcorrener: 0.122495 hartree
zpe.thermalcorrenthalpy: 0.123439 hartree
zpe.thermalcorrgfe: 0.084863 hartree
zpe.sumelectzpe: -232.910669 hartree
zpe.sumelectthermal: -232.903589 hartree
zpe.sumelectthermalent: -232.902645 hartree
zpe.sumelectthermalfe: -232.941221 hartree
dipole: 0.2687 0.3735 0.0008
dipole: 0.4602
quadrupole: -33.3887 -35.3427 -38.8423
quadrupole: 1.0364 -0.0093 0.0029
quadrupole: 2.4692 0.5152 -2.9844 1.0364 -0.0093 0.0029
hfenergy: -233.0260839 hartree
pointgroup: C01 [X(C6H8)]
dipole: 0.1069671 0.1453477 0.014409 debye
dipolederiv: 0.3710948 0.0218912 -0.0042469 -0.1449994 0.3063579 0.0367659 -0.022964 0.033789 0.012594 -0.0019112 -0.0502215 -0.0040183 0.0103746 -0.1566011 -0.0266017 0.0026497 -0.0258039 0.0748809 -0.1376794 -0.0430038 -0.0054049 -0.1305998 0.0386063 0.0269539 -0.0138591 0.025443 -0.1787453 -0.308794 -0.1310092 -0.0178346 -0.010124 -0.0303568 0.0481563 -0.0061181 0.0500836 -0.4603776 0.5216628 0.2050588 0.009016 0.3530934 -0.0421704 0.002842 0.02492 0.0057362 -0.1331514 -0.444285 0.049731 0.017254 -0.0064955 -0.3862849 -0.0571751 0.0111734 -0.0583273 0.132688 0.0370807 -0.0414034 -0.1213395 -0.0257272 0.0447761 -0.0184936 -0.0965145 -0.0608935 -0.0512062 -0.1135154 0.1366674 0.0189727 0.060469 0.0311473 -0.0099632 0.0105974 -0.0112247 0.1094457 0.0441407 -0.0646581 0.1067331 -0.0452015 0.0228882 0.0371374 0.0857914 0.0802178 -0.03581 0.0103381 -0.0595482 -0.003392 0.0136433 -0.0798883 -0.0284688 0.0045763 -0.0272612 0.1714566 -0.0668029 0.068742 0.012775 0.1008372 0.0161911 -0.021205 0.0170799 -0.0205128 0.1869086 0.0886088 0.0151783 0.0039767 -0.018138 -0.1320047 -0.0372113 0.0006215 -0.0375513 0.2031743 0.0030063 -0.0597583 0.0542797 -0.087363 0.1771787 0.0565143 0.0779891 0.0491742 -0.0125819 -0.0029443 -0.0476662 -0.0667709 -0.0697691 0.1901606 -0.0092513 -0.0959427 -0.0028692 -0.0192756 unknown
polarizability: 120.9467346|16.1416476|55.0742274|0.0920883|1.8191227|36.0547616 unknown
InChI: InChI=1S/C6H8/c1-4-5-6(2)3/h5H,1-2H2,3H3
charge 0 multiplicity 1
14 atoms
C  -1.062331 0.033737 -0.001361
C  -0.917173 1.534875 0.164362
C  0.172605 -0.775614 -0.113857
C  -2.281856 -0.581988 -0.047013
C  1.423638 -0.298357 -0.087322
C  2.674227 0.148887 -0.064125
H  -0.336954 1.776119 1.074965
H  -1.901177 2.027467 0.235678
H  -0.365838 1.973197 -0.688777
H  0.033101 -1.861599 -0.232033
H  -3.214469 -0.013729 0.034768
H  -2.374279 -1.668464 -0.165221
H  3.198492 0.443922 -0.983197
H  3.237115 0.241949 0.874333
