program: Gaussian 09
title: 000139823
version: EM64L-G09RevD.01
frameworkgroup: C1[X(C11H20O)]
method: RPBEPBE
basis: SDD
operation: Freq
keyword: #pfreq=noraman
keyword: PBEPBE/SDD
title: #p freq=noraman PBEPBE/SDD
converged: NO YES NO NO
title: Mulliken charges:
elementType: O C C C C C C C C C C C H H H H H H H H H H H H H H H H H H H H
charge: -0.155790 -0.229267 -0.227303 0.006905 0.290062 0.289457 -0.717052 -0.742861 -0.712080 -0.717249 -0.742238 -0.711752 0.235050 0.234476 0.236279 0.209750 0.206387 0.206116 0.236015 0.214485 0.206981 0.213218 0.221067 0.235820 0.209921 0.206327 0.206147 0.235956 0.214339 0.206868 0.213337 0.220630
chargesum: 0.00000
title: Mulliken charges with hydrogens summed into heavy atoms:
elementType: O C C C C C C C C C C C
charge: -0.155790 0.005782 0.007173 0.006905 0.290062 0.289457 -0.064636 -0.086245 -0.070814 -0.065182 -0.085796 -0.070916
polarizability: 1.34709055e+02 1.57628375e-02 1.20150094e+02 -3.72132693e+00 1.72842383e-02 1.03857740e+02
1716.lowfreq: -12.7292 -11.7867 -0.0006 -0.0005 0.0005 9.7421 33.4485 49.0073 80.8531
frequency: 33.3246 48.9397 80.8529 106.0635 134.5087 194.4766 203.1189 223.8366 245.2549 251.3859 258.4078 265.4065 274.2314 276.0073 311.9481 333.4959 372.2167 376.8790 378.0394 411.7697 439.8266 453.9063 474.2657 678.6299 698.2307 750.3268 764.2094 851.4691 873.4407 922.4772 923.4709 925.4109 926.8988 941.2877 942.3584 983.6861 993.8076 1016.4828 1028.5748 1035.7894 1043.7155 1072.8095 1092.1551 1174.1323 1186.3467 1222.9296 1223.3344 1245.0987 1263.8604 1275.5765 1302.5300 1374.1014 1375.6815 1375.9733 1376.2248 1402.0225 1403.0733 1458.1833 1459.0270 1461.6459 1465.6799 1466.2225 1467.2347 1480.2136 1480.6118 1484.7324 1485.9678 1493.8318 1495.3883 1776.6409 2967.2157 2967.6820 2970.1782 2970.3681 2975.7498 2975.8621 3047.9826 3056.2338 3061.8203 3062.2132 3065.4205 3065.6773 3067.9538 3068.3401 3071.9191 3072.6979 3073.3187 3073.4160 3078.2879 3078.7698
redmass: 2.6735 3.7678 3.2312 5.3785 2.9929 1.2364 1.0474 1.9289 1.9246 1.3181 1.0672 1.6452 1.1215 1.2372 2.4916 2.3405 2.8288 2.3049 2.4051 2.7293 2.3200 3.0080 2.3921 5.3048 3.3169 4.6666 4.9186 2.5108 2.4178 1.6651 1.6948 1.6934 1.7280 1.2055 1.2041 1.2765 1.5782 1.5377 1.4092 1.7381 1.4152 1.8413 1.9641 1.7829 1.9673 3.1532 3.1444 3.0172 3.0368 1.8426 2.0883 1.2004 1.2038 1.1992 1.2017 1.2071 1.2092 1.0500 1.0501 1.0487 1.0481 1.0481 1.0474 1.0551 1.0551 1.0536 1.0539 1.0593 1.0621 12.5676 1.0347 1.0347 1.0349 1.0349 1.0357 1.0358 1.0853 1.0859 1.1000 1.0997 1.0991 1.0994 1.0994 1.0984 1.0981 1.0982 1.0997 1.0996 1.0996 1.0993
irintensity: 0.0055 1.4955 0.3045 4.2503 0.7109 0.0146 0.0756 0.0031 0.0683 0.0085 0.0073 0.0026 0.0042 0.0132 0.3302 0.3917 0.6258 0.0479 0.2152 0.0014 0.1504 4.2902 0.2541 7.0439 3.1990 1.3145 0.5097 0.9835 28.1825 0.2606 0.8681 1.5381 1.7774 0.1393 0.1951 7.5355 47.5254 6.9998 0.1790 38.2603 5.9028 11.7528 0.7827 2.5639 10.5136 6.1674 0.4513 105.5779 7.1959 15.5725 6.8214 3.6174 34.2420 16.5219 39.0596 18.3799 1.2682 0.4287 0.0321 0.7859 0.2887 0.7074 0.4522 13.7109 13.0290 21.9752 8.4099 32.0537 5.4893 229.2845 14.5413 43.4659 51.7373 28.8514 25.0403 4.5329 1.0405 3.7051 0.7592 0.6765 18.7571 0.8972 11.0696 91.6326 134.0355 10.0014 12.4418 47.2826 48.8235 70.3835
temp: 298.150 k
press: 1.00000 atm
elementType: 8 6 6 6 6 6 6 6 6 6 6 6 1 1 1 1 1 1 1 1 1 1 1 1 1 1 1 1 1 1 1 1
symmnumber: 1
zpe: 736066.8 jmol-1
zpe.correction: 0.280353 hartree
zpe.thermalcorrener: 0.295717 hartree
zpe.thermalcorrenthalpy: 0.296661 hartree
zpe.thermalcorrgfe: 0.238954 hartree
zpe.sumelectzpe: -505.363878 hartree
zpe.sumelectthermal: -505.348514 hartree
zpe.sumelectthermalent: -505.347570 hartree
zpe.sumelectthermalfe: -505.405278 hartree
dipole: -0.0051 -3.2570 -0.0010
dipole: 3.2570
quadrupole: -71.8895 -87.7591 -74.3168
quadrupole: -0.0224 0.8737 -0.0092
quadrupole: 6.0989 -9.7706 3.6716 -0.0224 0.8737 -0.0092
hfenergy: -505.6442313 hartree
pointgroup: C01 [X(C11H20O1)]
dipole: 0.0468066 -1.2702 -0.1623637 debye
polarizability: 134.2278825|1.2162248|119.9641362|-5.1579598|1.8121713|104.5248699 unknown
InChI: InChI=1S/C11H20O/c1-10(2,3)7-8(9(7)12)11(4,5)6/h7-8H,1-6H3
charge 0 multiplicity 1
32 atoms
O  -0.07955 2.587028 0.350572
C  0.638441 0.186778 -0.460927
C  -0.616858 0.014251 0.520941
C  -0.035248 1.353151 0.190964
C  2.069183 -0.298707 -0.123722
C  -2.010362 -0.478386 0.063397
C  3.05801 0.501704 -1.015773
C  2.423169 -0.060024 1.367834
C  2.171286 -1.8138 -0.445249
C  -3.042534 -0.021461 1.131426
C  -2.410518 0.113522 -1.313652
C  -1.986043 -2.027849 -0.02365
H  0.392643 0.057889 -1.528155
H  -0.349836 -0.360993 1.522946
H  2.993617 1.584125 -0.802255
H  4.098603 0.173029 -0.834111
H  2.837077 0.352393 -2.089585
H  1.782645 -0.656214 2.043903
H  2.322524 1.006258 1.643279
H  3.470049 -0.360871 1.556441
H  1.967018 -2.008647 -1.514967
H  3.185958 -2.192303 -0.218391
H  1.446552 -2.396691 0.153089
H  -3.067332 1.080691 1.209092
H  -4.057385 -0.373782 0.86725
H  -2.790827 -0.427763 2.129342
H  -1.740441 -0.232251 -2.122548
H  -2.395762 1.219161 -1.298102
H  -3.435502 -0.207455 -1.575525
H  -1.734437 -2.477703 0.95544
H  -2.974379 -2.417936 -0.332416
H  -1.236459 -2.371445 -0.760688
