program: Gaussian 09
title: 000139809
version: EM64L-G09RevD.01
frameworkgroup: C1[X(C5H14OSi)]
method: RPBEPBE
basis: SDD
operation: Freq
keyword: #p
keyword: freq=noraman
keyword: PBEPBE/SDD
title: #p freq=noraman PBEPBE/SDD
converged: YES YES NO NO
title: Mulliken charges:
elementType: Si O C C C C C H H H H H H H H H H H H H H
charge: 1.296964 -0.286800 -0.624081 -1.018237 -1.018268 -1.022781 -0.489661 0.203464 0.203487 0.257383 0.227881 0.227454 0.227437 0.227736 0.257844 0.237616 0.232365 0.232338 0.199137 0.229630 0.199091
chargesum: 0.00000
title: Mulliken charges with hydrogens summed into heavy atoms:
elementType: Si O C C C C C
charge: 1.296964 -0.286800 -0.217129 -0.305518 -0.305251 -0.320462 0.138196
polarizability: 9.25550622e+01 2.00048389e+00 7.87040370e+01 -6.32382013e-03 5.16678423e-03 7.83033473e+01
1716.lowfreq: -0.0012 0.0012 0.0014 12.2838 16.3824 17.7019 60.1973 73.3081 101.0772
frequency: 58.6168 73.2187 101.0566 113.8270 127.4313 139.7269 181.4097 185.8118 206.0847 216.6409 235.1645 282.3187 352.8952 584.1929 691.5997 697.7534 703.1911 742.0809 748.0206 809.6852 864.8586 867.2916 911.1660 917.6188 927.8798 1050.5127 1108.4825 1138.5519 1171.4616 1279.8380 1292.4532 1293.9483 1306.0256 1428.0318 1441.8647 1447.0562 1448.3846 1450.8887 1452.8219 1455.1535 1455.7374 1464.7600 1474.1657 2898.5449 2920.8831 2950.6310 2977.9030 2981.9803 2982.9812 2992.7088 3080.0424 3081.1400 3083.3103 3084.1842 3092.7143 3094.3390 3095.2488
redmass: 2.4618 2.3936 2.7866 1.0233 1.0299 1.0565 2.2194 2.5523 2.4730 1.5579 1.7052 3.5717 3.6698 3.6864 3.3735 3.4739 2.4453 1.2015 1.1775 1.4954 4.7976 1.3471 1.5205 1.6492 1.6270 10.9799 1.2510 1.3206 1.1043 1.3680 1.2040 1.2031 1.1944 1.1146 1.0540 1.0680 1.0610 1.0546 1.0525 1.0488 1.0529 1.0477 1.0589 1.0519 1.0346 1.1036 1.0343 1.0341 1.0340 1.1027 1.0981 1.0986 1.0981 1.0977 1.0987 1.0982 1.0973
irintensity: 1.1679 7.3667 1.1459 0.0581 0.0002 0.0030 0.2267 0.0064 1.6424 6.3497 0.1416 11.3363 5.0055 2.5532 10.4181 10.8697 4.3299 0.9148 0.1439 23.5184 4.3794 0.5289 86.9087 105.8194 193.5849 77.4856 0.2142 0.7572 11.5094 1.3762 49.6332 44.7587 13.2339 4.1556 0.0078 6.2477 7.4801 0.0286 11.8766 10.3339 7.0705 17.1111 9.7549 45.0315 104.2940 57.2669 18.3868 21.3890 8.2379 72.9160 6.9378 4.1675 29.3541 42.5315 2.2610 24.1957 34.4807
temp: 298.150 k
press: 1.00000 atm
elementType: 14 8 6 6 6 6 6 1 1 1 1 1 1 1 1 1 1 1 1 1 1
symmnumber: 1
zpe: 467837.3 jmol-1
zpe.correction: 0.178190 hartree
zpe.thermalcorrener: 0.190233 hartree
zpe.thermalcorrenthalpy: 0.191177 hartree
zpe.thermalcorrgfe: 0.140539 hartree
zpe.sumelectzpe: -562.931430 hartree
zpe.sumelectthermal: -562.919387 hartree
zpe.sumelectthermalent: -562.918443 hartree
zpe.sumelectthermalfe: -562.969081 hartree
dipole: -0.4178 1.3480 0.0038
dipole: 1.4112
quadrupole: -48.4207 -53.5681 -53.6478
quadrupole: -2.5292 -0.0052 0.0001
quadrupole: 3.4582 -1.6893 -1.7689 -2.5292 -0.0052 0.0001
hfenergy: -563.1096197 hartree
pointgroup: C01 [X(C5H14O1Si1)]
dipole: -0.1772392 -0.526147 -0.0045401 debye
dipolederiv: 1.3633011 -0.0175998 -0.0010794 -0.0018865 1.2515434 -0.0007604 -0.0011893 -0.0005299 1.2493451 -1.0566473 0.1357366 0.0048515 0.0519558 -0.4109331 -0.0001517 0.0046027 -0.0005635 -0.4191111 0.1386649 -0.1980598 -0.0017985 -0.2649423 0.0685288 0.0020122 -0.0031519 0.0006448 0.0905059 -0.3248597 0.0179267 0.0145216 -0.0146029 -0.3591977 0.089819 0.0095116 0.0924229 -0.4127973 -0.3252448 0.0179143 -0.0146717 -0.0148153 -0.358575 -0.0893837 -0.0097039 -0.0918584 -0.41321 -0.4159524 0.0960268 0.0009089 0.0804905 -0.3953236 -0.0003276 0.0006192 -0.0004014 -0.2862631 0.6750963 0.0515213 -0.0011553 0.2047117 0.2494888 -0.0026791 0.000412 -0.0018125 0.3735794 -0.0122344 -0.0424108 0.0990001 0.0616607 -0.0767162 0.1187173 0.0301412 0.1518296 -0.1032807 -0.0135799 -0.0428972 -0.1010225 0.0604989 -0.0709098 -0.1189536 -0.030044 -0.15043 -0.1069931 0.0220906 0.113699 -0.0320625 0.1330721 -0.0163837 0.0197255 -0.0538509 0.0330921 0.1061906 -0.0888968 -0.1213109 0.022495 -0.1346938 0.0285406 0.0131016 0.0448108 0.0200335 0.0980983 0.1043095 -0.0071998 -0.0050819 0.0023789 0.0498046 -0.0988269 -0.0057569 -0.1143139 -0.1184984 0.1044522 -0.0062099 0.0030531 0.0034081 0.0489781 0.0994823 0.0037307 0.1150859 -0.1175936 -0.0888539 -0.1217357 -0.0214696 -0.1350157 0.0279964 -0.0123894 -0.043965 -0.019494 0.0984805 0.0230243 0.1131532 0.0331682 0.1328256 -0.0150665 -0.020959 0.055478 -0.0342506 0.105532 -0.1603654 -0.0625746 0.0005713 -0.0358452 0.0966432 -0.0000031 0.000513 0.0001873 0.1069535 0.1100794 0.0014828 -0.0036275 -0.0019746 -0.0177906 0.1384651 0.0012357 0.1296887 -0.0506495 0.1102088 0.0008672 0.002831 -0.0025351 -0.0164061 -0.1382958 -0.0019716 -0.1295196 -0.0520173 -0.0435046 -0.0118359 -0.0141293 -0.1362322 -0.0081783 -0.1346501 -0.0994141 -0.1222556 -0.1310164 -0.079242 0.0938569 0.0022903 0.1480599 -0.0620184 -0.0029869 0.0029033 -0.0026163 0.1093183 -0.0418459 -0.0103503 0.0124071 -0.1365187 -0.0140249 0.1390442 0.0950894 0.1250609 -0.1265732 unknown
polarizability: 92.448846|-2.3345278|78.8093188|-0.1084136|0.0249456|78.3042817 unknown
InChI: InChI=1S/C5H14OSi/c1-6-5-7(2,3)4/h5H2,1-4H3
charge 0 multiplicity 1
21 atoms
Si 1.012148 -0.045554 -0.006257
O  -1.708239 0.326269 0.015827
C  -0.763111 -0.80471 -0.001954
C  1.205745 1.027381 -1.576163
C  1.215146 1.021208 1.566585
C  2.271575 -1.491125 -0.013287
C  -3.10246 -0.10964 0.020367
H  -0.916134 -1.455791 0.89041
H  -0.928278 -1.437201 -0.905457
H  0.385034 1.765356 -1.626113
H  2.166785 1.574146 -1.57604
H  1.165498 0.408888 -2.491934
H  1.183609 0.398707 2.479971
H  2.174577 1.570758 1.561354
H  0.392483 1.756257 1.625833
H  3.308374 -1.106004 -0.014713
H  2.15276 -2.132039 0.880099
H  2.148612 -2.127477 -0.909379
H  -3.345508 -0.703803 -0.887318
H  -3.717059 0.805089 0.034977
H  -3.333058 -0.724315 0.917594
