program: Gaussian 09
title: 000139804
version: EM64L-G09RevD.01
frameworkgroup: C1[X(C7H15NOS)]
method: RPBEPBE
basis: SDD
operation: Freq
keyword: #p
keyword: freq=noraman
keyword: PBEPBE/SDD
title: #p freq=noraman PBEPBE/SDD
converged: YES YES NO NO
title: Mulliken charges:
elementType: S O N C C C C C C C H H H H H H H H H H H H H H H
charge: 0.234065 -0.269736 -0.121787 -0.376456 -0.341538 0.292810 -0.642435 -0.659891 -0.790543 -0.858266 0.223767 0.232174 0.201120 0.261895 0.222747 0.221521 0.218587 0.254052 0.202015 0.217507 0.261552 0.264610 0.248928 0.247886 0.255417
chargesum: 0.00000
title: Mulliken charges with hydrogens summed into heavy atoms:
elementType: S O N C C C C C C C
charge: 0.234065 -0.269736 -0.121787 0.079485 0.121477 0.292810 0.020419 0.013683 -0.264381 -0.106035
polarizability: 1.34219754e+02 -1.21124124e+00 1.02843712e+02 -2.55978898e-01 6.49313061e+00 7.53022164e+01
1716.lowfreq: -5.2444 -0.0032 -0.0029 -0.0027 5.4908 10.8180 38.1118 46.6177 67.0376
frequency: 37.6654 46.4932 67.0272 80.5819 119.4968 123.8691 137.5809 177.2030 199.7758 208.9595 231.8291 279.0028 314.4641 362.9912 431.6943 484.2294 562.4898 590.2300 655.3656 724.0015 759.3150 777.8694 786.9770 902.8095 910.6408 940.2725 967.9581 980.4454 1021.8073 1070.3798 1079.9639 1097.5769 1134.9057 1145.2462 1215.0626 1234.8302 1273.8138 1302.8924 1343.3892 1346.0474 1358.6193 1381.4813 1390.3309 1414.4445 1427.0998 1448.8618 1453.7817 1459.4351 1465.4908 1468.5330 1477.4753 1482.0128 1490.9501 1588.2674 2982.9978 2984.3035 2985.7725 2994.4376 2996.4518 3005.7970 3050.6465 3057.7800 3066.9352 3084.0309 3084.3235 3092.5955 3101.8926 3102.1083 3124.2999
redmass: 2.8842 3.3229 3.5713 3.2269 3.3112 2.6273 2.4069 1.1108 1.0992 1.3262 3.3994 2.8741 2.7343 2.9093 3.1223 2.9271 3.4247 3.3016 6.7348 3.9274 3.3565 1.1937 1.3321 1.7130 2.2263 2.1150 1.2316 1.3064 2.7367 2.0566 1.8562 1.7654 1.8351 1.1470 2.9230 1.4382 1.3835 1.3545 1.2483 1.1445 1.2914 1.2157 1.2084 2.4799 1.0955 1.0531 1.1094 1.0520 1.0448 1.0435 1.0667 1.0563 1.1043 6.9083 1.0360 1.0550 1.0366 1.0302 1.0645 1.0631 1.1044 1.0984 1.0994 1.0991 1.0990 1.1013 1.1019 1.1054 1.1015
irintensity: 0.1549 2.4534 1.1011 0.3633 1.1019 2.2314 3.2569 1.0447 0.1138 0.2365 4.5251 0.3795 3.0374 13.0882 6.8887 1.4202 5.7978 6.1159 1.7618 2.3557 11.2162 7.2704 9.2603 3.2266 6.2728 8.9035 11.1903 4.2455 2.3026 12.8115 7.4061 16.5675 76.6702 4.2594 32.0265 63.8772 23.2253 31.3006 5.0894 0.5445 8.3228 17.7007 23.4951 105.0603 17.2965 15.8584 18.9207 15.7395 7.2462 13.7423 6.8391 8.7617 14.9906 228.7006 25.4091 35.4086 17.2980 38.9325 38.6246 36.2018 18.3147 4.8285 12.1133 18.3141 61.0570 43.7995 29.6440 30.0956 13.1688
temp: 298.150 k
press: 1.00000 atm
elementType: 16 8 7 6 6 6 6 6 6 6 1 1 1 1 1 1 1 1 1 1 1 1 1 1 1
symmnumber: 1
zpe: 557150.6 jmol-1
zpe.correction: 0.212207 hartree
zpe.thermalcorrener: 0.225688 hartree
zpe.thermalcorrenthalpy: 0.226632 hartree
zpe.thermalcorrgfe: 0.170974 hartree
zpe.sumelectzpe: -802.949939 hartree
zpe.sumelectthermal: -802.936458 hartree
zpe.sumelectthermalent: -802.935514 hartree
zpe.sumelectthermalfe: -802.991173 hartree
dipole: -2.1376 4.9969 2.0056
dipole: 5.7931
quadrupole: -60.7296 -73.7781 -70.8873
quadrupole: 4.0961 2.5919 -1.1156
quadrupole: 7.7354 -5.3131 -2.4223 4.0961 2.5919 -1.1156
hfenergy: -803.1621466 hartree
pointgroup: C01 [X(C7H15N1O1S1)]
dipole: 0.718365 2.040669 -0.7171781 debye
dipolederiv: 0.0234956 -0.0104899 0.0084448 -0.1365076 0.0674421 -0.0994156 0.0555012 -0.0918563 -0.0873442 -0.7849708 0.00704 -0.0344516 -0.3692716 -0.9546572 0.16423 0.1058502 0.2199671 -0.388144 -1.1629151 -0.3138209 0.0969935 -0.2022932 -0.781955 -0.020126 0.0166987 0.016946 -0.367882 0.142907 0.0474293 -0.0190702 0.1173378 0.6210336 0.0162134 -0.0745154 -0.0303074 0.2621953 0.4867802 -0.1560732 -0.0120825 -0.2670233 0.2377994 0.0681974 0.096641 0.0995837 0.2109218 1.4975848 0.4668751 -0.0178671 0.5034407 1.0151074 -0.2563456 -0.004425 -0.2518072 0.2243389 0.0631737 -0.0072537 -0.000442 -0.0291137 -0.0812552 -0.065962 0.0096366 -0.1039574 -0.0445973 -0.0408652 0.0341646 0.0274762 0.055824 0.0127898 -0.071704 0.0229659 -0.1105889 -0.0336266 -0.0080732 0.1811778 -0.1042076 0.3387457 -0.0477934 0.1031732 -0.2105489 0.1005645 0.1064864 0.0565438 -0.0992293 0.0457099 -0.0422991 0.0400538 0.0175091 0.0248476 0.017629 0.069485 -0.0958001 -0.0534037 0.1409103 -0.0254771 0.009248 -0.0288484 0.1087124 0.001319 -0.0093537 -0.0270613 0.0555601 -0.1397682 0.0378064 -0.0007102 -0.0056362 -0.1190969 0.0009067 -0.012863 -0.0785216 -0.0648161 -0.0493956 -0.085962 -0.0540121 -0.1211421 -0.041972 -0.0857015 0.0369719 0.0906452 -0.0164939 0.0725803 0.0697668 0.0141892 0.077472 0.015742 0.0407221 -0.0171311 -0.080889 0.0190413 0.1213858 -0.0145306 0.0880202 0.0044189 0.1010034 -0.0112508 0.0161441 -0.0638846 0.0180518 -0.1217932 0.0633237 0.0925813 0.038527 -0.1012122 0.0039547 -0.0004545 0.0929764 -0.0314556 0.0091124 -0.0564709 -0.1813107 0.0635114 0.0086262 0.0857713 0.0474833 0.0355065 -0.114581 -0.0547779 -0.0717308 -0.0063276 -0.0661754 -0.0259808 -0.0416463 0.0558842 0.0917352 -0.0137582 0.0331879 -0.0491992 -0.0295992 0.1398414 0.0542376 0.0893543 -0.0705321 -0.1463026 0.1175041 -0.0414441 0.1325727 0.0449217 0.0147401 -0.0511037 0.0315375 0.06214 -0.0309515 -0.0297192 -0.0009368 -0.0566027 -0.1246331 -0.0566361 0.0163375 -0.0657289 0.0427352 -0.0438574 -0.0271205 0.0381875 -0.0437827 0.0470428 0.0664257 0.0535728 0.070546 -0.0972371 0.0505989 0.0348523 0.0212916 0.0942596 0.0392837 0.0825339 -0.0447681 0.0682255 -0.1521645 0.0479244 0.0079023 -0.0390854 0.0979879 -0.1443205 -0.0864824 -0.0432956 -0.0771135 0.0293782 -0.1157792 -0.0513835 0.0200418 -0.0608007 0.0770612 0.0216804 0.0265456 0.0229308 0.117166 unknown
polarizability: 133.9607119|3.0657531|103.5426883|0.0444698|-5.4707589|74.8622818 unknown
InChI: InChI=1S/C7H15NOS/c1-4-8(5-2)7(9)6-10-3/h4-6H2,1-3H3
charge 0 multiplicity 1
25 atoms
S  -2.901012 -0.832702 0.175228
O  -0.154099 -1.73197 0.538849
N  1.073588 0.16598 -0.005391
C  1.187746 1.557203 -0.494568
C  2.329379 -0.529517 0.373532
C  -0.122028 -0.534563 0.115559
C  1.252246 2.601575 0.643643
C  2.96881 -1.280922 -0.813269
C  -1.401364 0.20878 -0.297409
C  -4.200328 0.406699 -0.40448
H  2.10293 1.624162 -1.114026
H  0.342327 1.783684 -1.166639
H  3.028624 0.224535 0.781619
H  2.083944 -1.246065 1.175232
H  0.32853 2.587344 1.249162
H  2.101815 2.398473 1.319679
H  1.38063 3.618505 0.229063
H  2.286417 -2.069513 -1.172832
H  3.192757 -0.598318 -1.654082
H  3.915479 -1.758394 -0.500131
H  -1.477216 1.190672 0.203851
H  -1.417799 0.370879 -1.392214
H  -4.107652 0.596842 -1.48676
H  -4.122513 1.3529 0.156579
H  -5.178813 -0.056169 -0.201195
