program: Gaussian 09
title: 000139781
version: EM64L-G09RevD.01
frameworkgroup: C1[X(C12H18)]
method: RPBEPBE
basis: SDD
operation: Freq
keyword: #p
keyword: freq=noraman
keyword: PBEPBE/SDD
title: #p freq=noraman PBEPBE/SDD
converged: YES YES NO NO
title: Mulliken charges:
elementType: C C C C C C C C C C C C H H H H H H H H H H H H H H H H H H
charge: 0.143994 0.144011 0.144005 0.143992 0.143997 0.144021 -0.793963 -0.793985 -0.794052 -0.793962 -0.793989 -0.794050 0.220033 0.209957 0.220033 0.220008 0.220005 0.209926 0.209958 0.220034 0.220037 0.209956 0.220026 0.220038 0.209927 0.220006 0.220014 0.209958 0.220031 0.220034
chargesum: 0.00000
title: Mulliken charges with hydrogens summed into heavy atoms:
elementType: C C C C C C C C C C C C
charge: 0.143994 0.144011 0.144005 0.143992 0.143997 0.144021 -0.143940 -0.144046 -0.144023 -0.143942 -0.144042 -0.144027
polarizability: 1.24152542e+02 -4.35199158e-04 1.20530164e+02 -3.40442296e-04 5.41802258e-03 1.20525215e+02
1716.lowfreq: -16.5287 -9.6629 -0.0009 -0.0005 0.0002 9.7606 121.5362 126.4573 134.3233
frequency: 121.3944 126.3463 134.3219 136.4052 145.7025 147.0321 149.6852 155.6635 157.0396 161.8009 167.3530 182.2325 199.0990 200.3391 214.7940 426.1059 439.0055 439.6114 522.8169 523.0563 566.7093 637.2778 637.3791 675.8694 708.4444 709.9517 734.1325 779.8740 780.1195 886.0817 1048.2668 1048.4670 1048.6047 1048.8861 1049.2266 1057.2061 1077.4931 1080.6501 1081.3611 1094.1991 1094.4588 1215.5348 1282.5891 1283.4208 1320.7632 1321.5917 1380.9329 1381.5624 1387.1750 1387.6190 1388.6884 1395.1953 1416.4278 1454.2673 1458.2571 1462.1381 1462.8928 1467.0078 1467.2223 1467.7839 1468.8994 1473.5558 1474.3742 1477.5251 1484.8647 1496.7320 2952.6053 2952.7940 2954.7882 2954.9128 2955.1399 2960.4814 3032.6854 3034.4939 3034.8332 3035.3818 3038.2115 3038.4890 3047.0474 3047.5882 3049.4930 3049.9950 3052.6206 3054.4071
redmass: 1.0587 1.0148 2.5042 2.2792 1.2107 1.0166 2.5765 2.3906 1.8468 1.0264 1.0306 2.4388 2.6145 2.6035 2.5346 3.0108 2.9150 2.9171 3.7633 3.7621 4.0827 3.4240 3.4182 3.0281 3.1246 3.1259 2.7662 2.4529 2.4550 1.6085 1.5460 1.5700 1.5172 1.5162 1.7032 1.5359 1.7776 1.8775 1.8736 2.1731 2.1688 3.8018 5.2866 5.3071 4.5502 4.4358 1.3120 1.3074 1.3325 1.3239 1.2011 1.1782 4.2461 1.0466 1.0436 1.0474 1.0462 1.0493 1.0480 1.0486 1.0499 1.0652 1.0592 1.4820 1.1982 2.7294 1.0356 1.0356 1.0355 1.0355 1.0357 1.0356 1.0989 1.0989 1.0989 1.0991 1.0989 1.0989 1.0978 1.0978 1.0975 1.0975 1.0972 1.0975
irintensity: 0.0001 0.1458 0.0000 0.0000 0.2523 0.0003 0.0000 0.4445 0.4332 0.0001 0.0844 0.0045 3.0178 3.0874 0.1154 0.0000 0.0000 0.0000 0.0000 0.0000 0.0000 0.8256 0.8268 0.0001 0.0003 0.0004 2.9666 12.3326 12.3121 0.0004 0.2573 2.8044 16.1270 16.2025 15.0814 0.0059 0.0004 0.0059 0.0036 0.0450 0.0478 0.0000 0.0000 0.0000 0.7599 0.8230 0.0071 0.0271 3.8852 3.9446 36.1059 0.0010 0.0742 0.0001 0.1978 0.0000 0.0020 18.9394 0.0185 0.0526 22.7164 7.0110 10.4460 0.0380 53.3546 0.0000 0.0789 0.1166 119.4583 119.9966 103.4706 0.0108 0.0006 0.0029 0.0010 0.5101 91.6161 91.2312 0.0402 0.3514 50.7285 48.6575 90.7749 0.2741
temp: 298.150 k
press: 1.00000 atm
elementType: 6 6 6 6 6 6 6 6 6 6 6 6 1 1 1 1 1 1 1 1 1 1 1 1 1 1 1 1 1 1
symmnumber: 1
zpe: 676592.6 jmol-1
zpe.correction: 0.257701 hartree
zpe.thermalcorrener: 0.272819 hartree
zpe.thermalcorrenthalpy: 0.273763 hartree
zpe.thermalcorrgfe: 0.217553 hartree
zpe.sumelectzpe: -467.003545 hartree
zpe.sumelectthermal: -466.988427 hartree
zpe.sumelectthermalent: -466.987483 hartree
zpe.sumelectthermalfe: -467.043693 hartree
dipole: 0.0000 -0.0002 -0.0005
dipole: 0.0006
quadrupole: -71.5434 -73.8469 -73.8496
quadrupole: 0.0001 0.0000 0.0011
quadrupole: 1.5366 -0.7669 -0.7696 0.0001 0.0000 0.0011
hfenergy: -467.2612459 hartree
pointgroup: C01 [X(C12H18)]
dipole: 0.0000006 0.0002305 -0.000002 debye
polarizability: 124.1525414|-0.0016555|120.5296165|0.0007906|0.0056357|120.5257633 unknown
InChI: InChI=1S/C12H18/c1-7-8(2)9(7,3)12(6)10(7,4)11(8,12)5/h1-6H3
charge 0 multiplicity 1
30 atoms
C  -0.793004 -0.629082 0.650335
C  -0.792652 0.877984 0.218742
C  -0.79261 -0.24932 -0.870603
C  0.792248 -0.629908 0.650456
C  0.793008 0.877435 0.219809
C  0.793037 -0.2492 -0.87024
C  -1.783018 -1.416152 1.465714
C  -1.781931 1.97836 0.493194
C  -1.781884 -0.561183 -1.960884
C  1.781328 -1.418188 1.465798
C  1.782622 1.977169 0.495612
C  1.782884 -0.560984 -1.960021
H  -1.665386 -1.221064 2.549635
H  -2.82293 -1.151712 1.194178
H  -1.667605 -2.506203 1.306824
H  -1.666683 2.384492 1.517204
H  -1.662803 2.820413 -0.216449
H  -2.822461 1.612734 0.398914
H  -2.822401 -0.45498 -1.598505
H  -1.663077 0.119796 -2.826303
H  -1.666388 -1.598291 -2.332214
H  2.82155 -1.153456 1.195734
H  1.662542 -1.224423 2.549825
H  1.666015 -2.50804 1.305443
H  2.823049 1.611187 0.401581
H  1.664174 2.81972 -0.213545
H  1.667046 2.382693 1.519832
H  2.823205 -0.455864 -1.596765
H  1.666847 -1.597763 -2.332091
H  1.665279 0.12063 -2.82511
