program: Gaussian 09
title: 000139775
version: EM64L-G09RevD.01
frameworkgroup: C1[X(C38H20)]
method: RPBEPBE
basis: SDD
operation: Freq
keyword: #p
keyword: freq=noraman
keyword: PBEPBE/SDD
title: #p freq=noraman PBEPBE/SDD
converged: NO YES NO NO
title: Mulliken charges:
elementType: C C C C C C C C C C C C C C C C C C C C C C C C C C C C C C C C C C C C C C H H H H H H H H H H H H H H H H H H H H
charge: 0.058644 -0.119481 -0.050734 -0.007627 0.505534 0.125637 0.129797 0.170456 0.267664 0.511612 0.340037 0.318287 0.252448 -0.949424 0.625480 -0.418108 -0.548635 -0.459362 -0.385420 -0.527919 -0.421746 -0.729989 -0.733013 -0.329020 -0.618753 0.484093 0.483314 -0.780707 0.421685 0.414679 -0.453444 -0.453193 -0.434821 -0.435431 -0.243172 -0.243264 -0.245120 -0.242873 0.237374 0.228794 0.244719 0.226043 0.234646 0.242954 0.233313 0.232562 0.232548 0.235355 0.229718 0.253704 0.244218 0.244246 0.242104 0.243161 0.229340 0.229337 0.228829 0.228918
chargesum: 0.00000
title: Mulliken charges with hydrogens summed into heavy atoms:
elementType: C C C C C C C C C C C C C C C C C C C C C C C C C C C C C C C C C C C C C C
charge: 0.058644 -0.119481 -0.050734 -0.007627 0.505534 0.125637 0.129797 0.170456 0.267664 0.511612 0.340037 0.318287 0.252448 -0.712050 0.625480 -0.189314 -0.303916 -0.233319 -0.150774 -0.284965 -0.188433 -0.497427 -0.500464 -0.093665 -0.389034 0.484093 0.483314 -0.527003 0.421685 0.414679 -0.209225 -0.208947 -0.192717 -0.192270 -0.013832 -0.013926 -0.016291 -0.013955
chargesum: -0.00016
polarizability: 1.10379705e+03 2.27168102e+01 4.61490508e+02 -9.83161642e-03 -1.43278692e-03 1.45263397e+02
1716.lowfreq: -8.4858 -4.9155 -0.0035 0.0009 4.2713 4.6157 15.2502 40.8420 47.9039
frequency: 15.2487 40.8388 47.8994 59.5023 81.9565 86.4283 109.9658 123.9654 147.8413 165.1461 181.2223 192.6342 218.9526 233.1118 253.8447 256.0876 298.0763 299.7957 312.3012 316.0881 346.0604 363.6268 370.0039 400.5392 420.0159 423.4393 431.8692 451.6568 469.0580 470.6390 483.9220 511.3275 514.3272 514.6174 528.5413 529.6601 538.3060 546.8731 556.4355 574.0857 575.3959 608.3665 617.5449 619.5966 624.4661 629.5561 642.6867 665.8508 680.3767 683.4704 724.4295 729.9787 748.5322 755.8083 758.7952 760.8174 767.0498 774.7262 785.9429 790.3551 796.8893 800.2589 806.7258 827.9767 851.4696 858.5506 865.3993 877.2015 878.6952 895.5137 899.6759 901.7673 908.6499 915.8383 924.2099 929.6193 934.7027 951.1773 965.3147 967.8899 968.4887 983.5651 986.3987 989.3688 989.9921 1002.6300 1015.6878 1016.9213 1018.2115 1041.0485 1064.4488 1095.2510 1111.4319 1133.7760 1133.8071 1137.2508 1165.2971 1171.7856 1172.3647 1186.9787 1194.8831 1206.4846 1214.6400 1223.8366 1235.1045 1249.8361 1256.9169 1259.4729 1274.1858 1285.3352 1300.3929 1303.9149 1307.7431 1315.4116 1327.9076 1342.0170 1344.8374 1375.3219 1381.4935 1388.1884 1401.6148 1408.0511 1411.9488 1414.7066 1423.2377 1435.2012 1438.0259 1439.9025 1444.3029 1456.1249 1461.0811 1473.5413 1484.5620 1491.9528 1501.4429 1525.8666 1547.4875 1561.6248 1570.5919 1578.5874 1581.1029 1599.2906 1601.9669 1610.6669 1613.8406 1619.8751 1635.6862 1638.8159 3116.2481 3118.5628 3118.7921 3123.6479 3124.1245 3127.9837 3130.3898 3134.7520 3140.5018 3141.4545 3142.1081 3143.5729 3146.0092 3148.3450 3161.0222 3161.1674 3164.9910 3165.6033 3170.5822 3174.2624
redmass: 6.3664 4.3131 5.5372 4.2506 4.9444 6.0089 4.4975 5.2272 5.5187 4.4640 4.0603 7.4205 4.7522 4.4123 4.1268 5.6240 6.8073 4.1978 5.7192 4.2014 4.4875 4.5013 6.0350 6.7641 3.7156 7.0411 3.6027 5.1718 2.5410 2.4915 3.5955 6.0795 6.4813 4.1801 3.4382 7.7298 7.5345 3.3128 6.5210 3.3788 6.9031 3.6901 6.2308 3.9322 5.1937 6.7117 7.2954 7.1531 6.9319 2.8369 7.0852 4.4329 1.7192 1.2962 1.2985 6.4718 5.3930 2.9663 1.8301 5.4420 5.4780 1.7111 1.7845 2.3566 1.3519 1.5021 1.5924 1.8907 6.0823 4.6697 1.7365 5.9038 1.5967 1.7042 1.7033 6.0566 5.9606 2.5545 1.3882 1.4158 1.4209 1.3677 1.4572 1.3529 1.3619 4.5663 2.2854 5.2321 2.3182 4.5469 3.1781 3.2839 2.0351 9.8193 1.7085 1.7128 1.6928 1.0814 1.0908 1.3590 1.2924 1.3856 1.6702 1.5864 1.5871 1.7740 2.1886 2.5554 2.5561 2.0143 1.7262 2.8875 2.2662 1.9694 2.3524 3.7401 2.5570 5.9738 2.7903 5.1745 4.3767 5.4448 5.4663 3.7807 2.6242 3.7659 4.8239 6.0434 3.9621 3.4369 2.8111 3.1330 3.1626 4.0502 4.4287 3.9010 5.5054 6.7034 6.3598 6.2135 6.3153 5.0769 6.0613 6.7269 6.8224 6.4872 6.7250 6.8821 1.0910 1.0858 1.0860 1.0890 1.0886 1.0888 1.0883 1.0869 1.0913 1.0945 1.0946 1.0910 1.0906 1.0911 1.1003 1.1002 1.0889 1.0934 1.0919 1.0958
irintensity: 0.0307 0.1183 0.0725 0.0028 2.5266 0.2206 0.0198 0.3244 0.0053 0.1479 1.7144 0.0339 1.0272 0.0169 1.2253 0.5585 0.3702 0.0805 0.1244 0.1878 0.0971 0.1004 0.0107 0.1232 0.0109 0.5134 0.5325 2.2997 20.7649 14.2684 0.1910 4.7092 6.4277 0.0275 0.1018 0.6653 5.6355 0.3178 4.3453 3.1817 4.7380 7.6510 7.3296 0.3757 0.3152 0.0393 0.3330 1.2418 3.1858 14.4499 0.3646 2.7034 1.1571 101.7415 18.9431 6.1031 8.4377 4.1987 4.1819 0.0351 1.5588 3.5277 13.5402 51.1439 1.4879 1.2775 23.2800 44.6052 1.7086 0.6515 7.4403 1.4587 44.4321 43.6005 1.0496 0.5947 0.7521 8.6788 0.1259 22.7733 3.0549 2.1994 0.5106 0.0577 0.2924 0.4255 6.7171 6.6844 7.1964 0.0132 0.2237 5.4169 4.3238 0.0162 2.4282 11.6439 2.1124 1.2604 0.8974 0.9145 9.1547 5.4702 4.2222 7.2620 13.6026 12.5868 0.1873 1.5103 1.2479 2.9890 0.5264 3.1765 3.4151 0.2869 2.4099 4.8796 6.9943 5.2313 5.4753 2.6514 2.3303 8.9259 3.3567 2.4266 11.6179 4.5978 1.3202 3.0451 0.6860 3.1404 7.0010 5.6255 5.6007 0.2290 38.0532 8.3192 0.2676 1.7205 2.7345 3.3131 7.5390 1.9629 2.5897 0.0495 10.1287 3.3018 1.8442 0.7773 6.9427 3.6553 5.0757 0.5725 1.6782 0.7088 20.9735 9.6922 0.7276 23.9252 28.2618 6.0486 10.3546 0.6084 110.8232 24.9979 6.8817 28.4852 36.4793 29.0902
temp: 298.150 k
press: 1.00000 atm
elementType: 6 6 6 6 6 6 6 6 6 6 6 6 6 6 6 6 6 6 6 6 6 6 6 6 6 6 6 6 6 6 6 6 6 6 6 6 6 6 1 1 1 1 1 1 1 1 1 1 1 1 1 1 1 1 1 1 1 1
symmnumber: 1
zpe: 1178232.1 jmol-1
zpe.correction: 0.448765 hartree
zpe.thermalcorrener: 0.473490 hartree
zpe.thermalcorrenthalpy: 0.474434 hartree
zpe.thermalcorrgfe: 0.395087 hartree
zpe.sumelectzpe: -1457.753205 hartree
zpe.sumelectthermal: -1457.728480 hartree
zpe.sumelectthermalent: -1457.727536 hartree
zpe.sumelectthermalfe: -1457.806883 hartree
dipole: 0.0212 -0.0198 0.0005
dipole: 0.0290
quadrupole: -177.8848 -181.3219 -232.1843
quadrupole: -0.1021 0.0005 -0.0004
quadrupole: 19.2455 15.8085 -35.0539 -0.1021 0.0005 -0.0004
hfenergy: -1458.20197 hartree
pointgroup: C01 [X(C38H20)]
dipole: -0.008338 -0.0077947 -0.0001844 debye
polarizability: 1103.7840731|-22.8994666|461.5034802|-0.0098312|0.0014356|145.2633967 unknown
InChI: InChI=1S/C38H20/c1-2-7-23-17-31-26(16-22(23)6-1)20-34-28-11-5-10-27-32-18-24-8-3-4-9-25(24)19-33(32)30-15-13-21-12-14-29(31)37(34)35(21)38(30)36(27)28/h1-20H
charge 0 multiplicity 1
58 atoms
C  -1.148445 0.566087 0.000259
C  0.118123 1.265636 0.000231
C  -1.165835 -0.895375 0.000421
C  1.372372 0.548649 0.000133
C  1.366492 -0.909577 0.000306
C  0.074656 -1.628046 0.000597
C  -2.373312 1.304687 0.000388
C  -2.421809 -1.600481 0.00037
C  2.616068 1.268127 -0.000103
C  0.132047 2.705618 0.000235
C  -3.667257 0.602026 0.000165
C  -3.69321 -0.850954 -0.000113
C  3.887388 0.54406 -0.000369
C  2.588027 -1.586072 0.000106
C  3.851754 -0.912067 -0.00024
C  -2.31561 2.736823 0.000427
C  -1.105639 3.417914 0.000351
C  2.583287 2.70397 -0.000099
C  0.028083 -3.045592 0.0011
C  1.384525 3.400044 0.000102
C  -2.40784 -3.019982 0.0010
C  -4.892007 1.302401 0.000137
C  -4.940877 -1.506061 -0.001038
C  -1.197745 -3.733531 0.001386
C  5.149411 1.180396 -0.000785
C  -6.151408 0.645088 -0.000509
C  -6.176829 -0.804794 -0.001287
C  5.063127 -1.647975 -0.000502
C  6.366886 0.449534 -0.001064
C  6.325147 -1.00797 -0.000895
C  -7.39607 1.364093 -0.000554
C  -7.445468 -1.479974 -0.002212
C  7.648749 1.104519 -0.001494
C  7.565494 -1.740386 -0.00115
C  -8.611732 0.680875 -0.001403
C  -8.636749 -0.754794 -0.002271
C  8.829362 0.365086 -0.001751
C  8.787181 -1.07246 -0.001579
H  2.616817 -2.679358 0.000147
H  -3.239306 3.319989 0.000441
H  -1.087446 4.513648 0.000345
H  3.519449 3.268328 -0.00023
H  0.951318 -3.629648 0.001373
H  1.380045 4.495928 0.000144
H  -3.343799 -3.583378 0.001337
H  -4.901196 2.396054 0.000509
H  -4.988758 -2.598925 -0.001699
H  -1.209191 -4.828556 0.001941
H  5.218346 2.272978 -0.000965
H  5.017898 -2.744403 -0.00042
H  -7.376612 2.460581 0.00008
H  -7.464244 -2.576487 -0.002852
H  7.68269 2.20073 -0.001628
H  7.532332 -2.836496 -0.001023
H  -9.555613 1.237056 -0.001426
H  -9.599388 -1.27783 -0.002981
H  9.798436 0.876177 -0.002099
H  9.724688 -1.639429 -0.001795
