program: Gaussian 09
title: 000139725
version: EM64L-G09RevD.01
frameworkgroup: C1[X(C6H8)]
method: RPBEPBE
basis: SDD
operation: Freq
keyword: #p
keyword: freq=noraman
keyword: PBEPBE/SDD
title: #p freq=noraman PBEPBE/SDD
converged: NO NO NO NO
title: Mulliken charges:
elementType: C C C C C C H H H H H H H H
charge: -0.549145 -0.549147 0.327035 0.327047 -0.696436 -0.696435 0.231531 0.231521 0.231534 0.231516 0.231369 0.224121 0.231368 0.224120
chargesum: 0.00000
title: Mulliken charges with hydrogens summed into heavy atoms:
elementType: C C C C C C
charge: -0.086093 -0.086096 0.327035 0.327047 -0.240946 -0.240947
polarizability: 8.63149381e+01 -2.42856052e-06 7.12530213e+01 5.73755430e-04 -4.86829716e-04 3.61429312e+01
1716.lowfreq: -8.0285 0.0002 0.0004 0.0008 12.9171 18.9508 66.0141 253.3925 279.5781
frequency: 65.9111 253.3925 279.5773 410.8346 458.4460 622.8286 648.9540 743.3585 752.6516 764.5069 874.0446 899.1751 916.1186 924.0550 933.3484 1023.3809 1080.1130 1156.8533 1173.3463 1184.2742 1230.2475 1256.9686 1406.8070 1427.5115 1435.6661 1453.1476 1661.7915 1687.9234 3008.5583 3018.7016 3066.0183 3086.6858 3090.6219 3091.2243 3194.7705 3197.1041
redmass: 1.9548 2.4438 2.8724 2.2024 1.6778 1.0170 4.2918 1.2410 3.4670 1.1308 2.1297 1.7435 1.3299 1.3287 3.1846 2.1131 1.1940 2.3754 1.1411 1.6509 1.4569 2.5608 1.1790 1.1478 1.0824 1.1125 6.1590 7.2389 1.0570 1.0627 1.1059 1.1052 1.0622 1.0606 1.1144 1.1145
irintensity: 0.0000 0.0494 12.5866 0.0116 0.0000 2.2615 4.4953 0.0000 0.2733 2.2096 0.0794 0.2294 0.0000 164.2812 1.4951 0.0000 1.5394 9.2665 0.0000 10.1153 3.0898 12.3023 9.2377 17.4399 5.5030 2.5893 8.4605 12.0003 26.0972 38.9994 0.0001 45.6075 4.3899 8.0807 10.8797 14.0597
temp: 298.150 k
press: 1.00000 atm
elementType: 6 6 6 6 6 6 1 1 1 1 1 1 1 1
symmnumber: 1
zpe: 307912.3 jmol-1
zpe.correction: 0.117278 hartree
zpe.thermalcorrener: 0.123395 hartree
zpe.thermalcorrenthalpy: 0.124339 hartree
zpe.thermalcorrgfe: 0.087601 hartree
zpe.sumelectzpe: -232.915998 hartree
zpe.sumelectthermal: -232.909880 hartree
zpe.sumelectthermalent: -232.908936 hartree
zpe.sumelectthermalfe: -232.945675 hartree
dipole: 0.0000 0.5908 0.0001
dipole: 0.5908
quadrupole: -34.5300 -33.9074 -39.3211
quadrupole: 0.0000 0.0000 0.0000
quadrupole: 1.3895 2.0121 -3.4016 0.0000 0.0000 0.0000
hfenergy: -233.0332752 hartree
pointgroup: C01 [X(C6H8)]
dipole: -0.0000096 0.2324497 0.0000479 debye
dipolederiv: 0.0222416 0.0338759 0.0000875 -0.0681181 -0.1251014 -0.0000651 0.0000189 -0.0000851 0.1673662 0.022238 -0.0338511 0.0000861 0.0681454 -0.1250869 0.0000386 0.0000328 0.0000441 0.1673613 0.1435696 -0.1389193 -0.0000201 -0.1229625 0.2887856 0.0000648 0.0000623 0.0001349 -0.0389406 0.1435236 0.1388925 -0.0000206 0.1229359 0.2888413 -0.0000532 -0.0000095 -0.0001115 -0.0389386 -0.1667675 -0.12407 -0.0000651 -0.1578261 -0.1182177 0.0000611 -0.0000514 0.0000468 -0.4146787 -0.1668023 0.124066 -0.000002 0.1578197 -0.1181815 -0.0000545 -0.0000288 -0.0000199 -0.4146752 0.018366 0.0341858 -0.0801774 0.031347 -0.0046074 0.0705408 -0.0924852 0.1115153 -0.048715 0.0184926 0.0340817 0.0801274 0.0312553 -0.0045228 -0.070532 0.0924503 -0.1114965 -0.0488991 0.0183629 -0.0341716 -0.0801821 -0.0313286 -0.0046032 -0.0705417 -0.0924725 -0.1115303 -0.0487224 0.0185114 -0.034088 0.0801106 -0.0312684 -0.0045545 0.0705658 0.0924309 0.1115215 -0.0488907 -0.0911831 0.0255428 0.0000267 0.0516022 0.0713591 -0.0000244 0.0000211 -0.000021 0.1895392 0.0553066 0.0609101 0.0000223 0.0230838 -0.1077255 -0.0000511 0.0000175 -0.0000562 0.1943281 -0.0911768 -0.025567 0.0000013 -0.0516249 0.0713484 0.0000158 0.0000079 0.0000134 0.1895386 0.0553175 -0.0608878 0.0000053 -0.0230608 -0.1077333 0.0000351 0.0000057 0.0000445 0.1943269 unknown
polarizability: 86.314938|0.0012182|71.2530214|0.0005738|-0.0004868|36.1429312 unknown
InChI: InChI=1S/C6H8/c1-5-3-4-6(5)2/h1-4H2
charge 0 multiplicity 1
14 atoms
C  -0.792155 1.356421 0.000296
C  0.791952 1.356538 -0.00013
C  -0.746358 -0.185915 0.00006
C  0.746405 -0.185787 -0.00005
C  -1.703631 -1.149382 0.000007
C  1.703818 -1.149118 0.000114
H  -1.253887 1.807795 -0.895237
H  -1.253313 1.807404 0.896322
H  1.25365 1.807898 0.895427
H  1.253025 1.807716 -0.896109
H  -2.769282 -0.894057 0.000127
H  -1.444603 -2.214898 -0.000193
H  2.769434 -0.893646 0.000112
H  1.444944 -2.21467 0.000254
