program: Gaussian 09
title: 000139721
version: EM64L-G09RevD.01
frameworkgroup: C1[X(C7H12N2)]
method: RPBEPBE
basis: SDD
operation: Freq
keyword: #pfreq=noraman
keyword: PBEPBE/SDD
title: #p freq=noraman PBEPBE/SDD
converged: YES YES NO NO
title: Mulliken charges:
elementType: N N C C C C C C C H H H H H H H H H H H H
charge: -0.080576 -0.096595 -0.255972 -0.229693 -0.512813 -0.211032 -0.195419 -0.604872 -0.602596 0.268984 0.251474 0.235303 0.243324 0.240856 0.238930 0.226562 0.211542 0.222219 0.214262 0.202370 0.233741
chargesum: 0.00000
title: Mulliken charges with hydrogens summed into heavy atoms:
elementType: N N C C C C C C C
charge: -0.080576 -0.096595 0.013012 0.021781 -0.034186 0.029824 0.043512 0.055451 0.047777
polarizability: 8.90314151e+01 -2.79978862e+00 8.63605252e+01 4.16417194e-01 4.13513848e+00 7.35139571e+01
1716.lowfreq: -9.6234 -0.0005 -0.0004 -0.0003 2.0071 9.1024 142.8916 209.5408 213.9708
frequency: 142.8710 209.5170 213.9699 244.8700 268.7131 341.5043 411.3459 450.9762 486.7058 540.2537 616.6252 634.4857 722.8754 761.8102 765.8238 828.4076 862.6645 881.7870 909.3527 924.2736 964.3911 976.4186 1016.7616 1053.2956 1074.3219 1088.7569 1106.6272 1119.7020 1122.6863 1145.7653 1170.2355 1186.7964 1234.9976 1243.9817 1251.1569 1263.5054 1312.7429 1410.9929 1418.9686 1448.5112 1451.6401 1461.0309 1478.6752 1486.3176 1569.6617 2922.5720 2947.6810 3038.9446 3041.6825 3046.6474 3082.5718 3089.8162 3099.9633 3107.5301 3122.7969 3159.2819 3195.0842
redmass: 2.9348 1.0579 1.2220 1.9613 2.3881 2.6409 2.5044 3.3817 2.2446 3.1600 3.7561 4.1658 1.9176 3.7815 3.8795 3.8663 3.2707 2.3251 1.9105 1.5710 1.7568 1.9468 1.5090 1.9997 2.5607 1.3191 1.3609 1.3474 1.3441 2.0385 1.7888 3.2484 1.8773 1.2779 1.3580 1.4576 1.7855 1.1535 1.1556 1.0588 1.0595 1.0796 1.0504 1.0473 5.7337 1.0457 1.0384 1.0648 1.0801 1.0938 1.1002 1.0997 1.0895 1.0936 1.1065 1.0887 1.1092
irintensity: 2.7960 0.2978 0.9442 3.8601 0.4432 8.2202 12.2854 13.3344 0.9149 8.6434 8.5338 0.1925 44.7523 7.9645 9.7435 8.1929 30.8295 11.1137 15.0127 1.5112 3.8324 2.9859 19.9457 7.9888 6.2742 5.6679 0.6332 0.9635 1.1489 2.1224 0.2492 6.3931 1.8982 0.7541 3.5159 1.9249 18.3481 2.8115 0.6604 3.0067 12.3219 20.6164 12.2158 7.6309 4.6730 96.8221 71.6798 17.1217 54.4799 39.4330 23.7388 12.7052 62.5593 13.2428 23.0825 9.1736 14.6149
temp: 298.150 k
press: 1.00000 atm
elementType: 7 7 6 6 6 6 6 6 6 1 1 1 1 1 1 1 1 1 1 1 1
symmnumber: 1
zpe: 473310.5 jmol-1
zpe.correction: 0.180274 hartree
zpe.thermalcorrener: 0.188473 hartree
zpe.thermalcorrenthalpy: 0.189417 hartree
zpe.thermalcorrgfe: 0.148333 hartree
zpe.sumelectzpe: -382.642168 hartree
zpe.sumelectthermal: -382.633970 hartree
zpe.sumelectthermalent: -382.633026 hartree
zpe.sumelectthermalfe: -382.674110 hartree
dipole: -0.4906 -0.3891 0.1967
dipole: 0.6564
quadrupole: -53.7732 -50.9975 -56.1882
quadrupole: -2.5225 -0.0966 0.5645
quadrupole: -0.1203 2.6555 -2.5352 -2.5225 -0.0966 0.5645
hfenergy: -382.8224426 hartree
pointgroup: C01 [X(C7H12N2)]
dipole: -0.2159137 -0.1063601 0.0935714 debye
dipolederiv: -0.483079 -0.0664506 -0.1411202 -0.0773322 -0.2226721 0.0684983 -0.1305945 -0.0576719 -0.3367641 -0.4199919 0.0009177 0.024389 0.0078026 -0.2845898 0.1208307 0.1132354 0.0336128 -0.3814616 0.2651054 0.0505517 -0.0369204 0.0602855 0.0431244 0.0536349 -0.0366817 0.1210302 0.3277723 0.2550544 0.0453236 -0.0980966 0.0435367 0.2505343 0.0200854 0.0103297 -0.04877 0.1879182 0.0658827 -0.0141713 0.0586833 -0.0198854 -0.104296 -0.0696012 0.10773 -0.0280007 -0.0687639 -0.1847843 -0.0579127 0.1675475 -0.0123514 -0.0093345 0.0454229 0.2642875 -0.0227546 -0.1238456 -0.0718071 -0.1338195 0.0979585 -0.2122676 -0.181687 -0.0082622 -0.0238955 0.1012376 0.0036281 0.1536352 0.0483494 0.05159 0.1206574 0.3197712 -0.0464704 0.0073325 -0.0759757 0.2306776 0.2860048 -0.1153756 0.0340329 -0.1491328 0.1995985 -0.0410405 -0.0174998 -0.0432302 0.2810345 0.0333956 0.0177515 0.0146298 0.0336765 -0.0268087 -0.1181819 0.0317335 -0.1108233 -0.0389902 0.0442603 0.0477836 0.0195811 0.0302609 -0.136798 -0.0531718 0.009111 -0.0583446 0.060216 -0.0182499 0.0659142 -0.1585471 0.0390534 0.0766884 0.0551599 -0.099846 0.0634675 -0.0347339 -0.0991595 -0.0837244 0.0908996 -0.0454875 0.0484759 0.0401455 0.0610904 0.0327352 0.0503443 0.0849725 0.0995691 -0.0725209 0.1429546 -0.0054681 0.0346798 -0.1176713 0.0287214 0.0868077 0.1284403 0.0393734 -0.0776447 0.0355343 0.1107273 -0.0392837 -0.1321035 -0.0611884 -0.0517749 -0.1507059 -0.0681278 0.0662944 -0.0007151 0.0797666 0.0092537 0.06503 0.048324 0.0645721 0.0955635 0.073341 0.0335672 0.0124364 -0.1186424 -0.0741175 0.0253263 -0.1251829 0.000087 0.0395879 0.0617856 -0.1268877 -0.0347328 0.0220118 0.0104243 -0.0588864 0.1282212 -0.14162 0.0685734 0.0187927 -0.0048534 0.103101 -0.0992935 -0.1049276 0.0234549 -0.1236093 0.0065306 0.0036125 0.0294784 0.0359134 0.0675804 0.0170988 0.0710559 -0.1102454 0.1597961 -0.2072486 -0.0963106 -0.0593499 0.0215043 -0.1449749 0.0217929 0.0258654 0.0087631 0.0384055 0.0856145 unknown
polarizability: 87.9853463|-2.9012767|88.1326763|1.1487112|2.541639|72.7878749 unknown
InChI: InChI=1S/C7H12N2/c1-8-6-3-4-7(5-6)9(8)2/h3-4,6-7H,5H2,1-2H3
charge 0 multiplicity 1
21 atoms
N  0.717829 0.799779 0.385394
N  0.92991 -0.442238 -0.469916
C  -0.71766 0.653379 0.90113
C  -0.353136 -1.241507 -0.226855
C  -0.709944 -0.859943 1.251518
C  -1.681757 0.665267 -0.300466
C  -1.441852 -0.486683 -0.995582
C  0.966797 2.007988 -0.441688
C  2.151748 -1.147799 0.003012
H  -0.896571 1.367868 1.716419
H  -0.202929 -2.301104 -0.47637
H  0.07032 -1.124601 1.984273
H  -1.694531 -1.231784 1.571444
H  -2.320517 1.501786 -0.596297
H  -1.830245 -0.779521 -1.973349
H  2.03564 2.034569 -0.713833
H  0.745078 2.900668 0.172417
H  0.370396 2.037183 -1.376617
H  2.30067 -2.0401 -0.63216
H  2.115069 -1.454889 1.071621
H  3.019486 -0.480417 -0.129795
