program: Gaussian 09
title: 000011161
version: EM64L-G09RevD.01
frameworkgroup: C1[X(C6H11N3O4)]
method: RPBEPBE
basis: SDD
operation: Freq
keyword: #p
keyword: freq=noraman
keyword: PBEPBE/SDD
title: #p freq=noraman PBEPBE/SDD
converged: YES YES NO NO
title: Mulliken charges:
elementType: O O O O N N N C C C C C C H H H H H H H H H H H
charge: -0.288299 -0.289139 -0.451255 -0.208076 -0.362700 -0.379737 -0.526106 -0.451241 0.228754 -0.386024 0.207453 -0.509368 0.184854 0.262291 0.260894 0.346603 0.364435 0.284307 0.284438 0.244731 0.223853 0.270509 0.289388 0.399434
chargesum: 0.00000
title: Mulliken charges with hydrogens summed into heavy atoms:
elementType: O O O O N N N C C C C C C
charge: -0.288299 -0.289139 -0.051821 -0.208076 -0.016097 -0.015302 0.033791 0.071944 0.228754 0.182721 0.207453 -0.040785 0.184854
polarizability: 1.39847752e+02 1.33088826e+00 9.75272410e+01 3.62952030e-01 -2.21757847e-01 5.97378233e+01
1716.lowfreq: -2.8214 -1.2645 -0.0006 -0.0005 -0.0001 3.7086 16.6822 26.5421 44.3608
frequency: 15.4250 26.3672 44.3388 47.8613 56.4334 77.1021 130.7373 155.3013 177.8427 200.0397 210.9426 267.5556 287.1946 313.4727 442.2658 489.5215 535.1355 543.2366 552.8203 565.9954 626.2383 640.7063 652.0470 683.8270 694.0372 764.5262 816.8434 890.1079 912.0552 956.7215 977.1889 987.8947 1069.3795 1078.9827 1122.0087 1129.1519 1163.1871 1198.1280 1214.2166 1219.8143 1233.4950 1301.3231 1310.6142 1320.0594 1340.2255 1349.7629 1440.9870 1459.5547 1472.2529 1474.0422 1502.1129 1601.1057 1625.6804 1662.0712 1689.0878 2972.3747 2981.0123 2995.9641 3012.3921 3035.0116 3042.5326 3437.2407 3467.1487 3535.6946 3540.6448 3553.0584
redmass: 5.2964 2.5275 5.0993 4.0174 5.8372 7.9890 5.4711 2.2728 2.0948 2.1367 3.8897 2.7822 8.0649 5.7531 5.0743 1.8603 2.8977 4.1174 3.7742 3.3312 1.1407 4.2403 1.4489 1.1524 2.4428 2.3854 4.7040 1.6612 5.1222 4.3132 1.9807 2.0982 5.8242 2.0081 4.0598 1.6325 2.2420 1.0901 1.0815 1.6444 1.7868 2.0398 1.4252 1.4377 1.3761 1.6315 1.0935 1.0797 1.2147 1.9195 2.2235 9.1931 6.2222 1.0807 9.3452 1.0588 1.0614 1.0602 1.1013 1.0997 1.1009 1.0457 1.0776 1.0647 1.0784 1.0952
irintensity: 0.8363 0.4166 4.2866 3.0823 1.8793 7.9757 3.8470 8.4419 2.8471 59.2006 27.8198 41.6317 15.4369 13.7918 10.2126 46.6926 6.1020 52.1618 2.9598 7.8991 14.1036 7.4075 237.5086 100.8190 99.5243 265.9454 20.0500 4.8438 11.8423 33.9731 1.5761 0.2869 1.7947 248.6302 0.8661 1.3560 3.0066 0.1710 0.0091 12.2673 10.3171 30.4229 43.5611 4.4903 19.5674 2.1556 22.8129 14.3312 42.5294 601.3145 164.7025 266.1485 78.0853 35.2239 259.3272 34.7174 28.4466 20.4557 14.9102 4.1401 23.1722 1.3475 109.7505 28.5040 94.5322 2.3053
temp: 298.150 k
press: 1.00000 atm
elementType: 8 8 8 8 7 7 7 6 6 6 6 6 6 1 1 1 1 1 1 1 1 1 1 1
symmnumber: 1
zpe: 486234.7 jmol-1
zpe.correction: 0.185197 hartree
zpe.thermalcorrener: 0.200007 hartree
zpe.thermalcorrenthalpy: 0.200952 hartree
zpe.thermalcorrgfe: 0.139581 hartree
zpe.sumelectzpe: -699.397087 hartree
zpe.sumelectthermal: -699.382277 hartree
zpe.sumelectthermalent: -699.381332 hartree
zpe.sumelectthermalfe: -699.442704 hartree
dipole: -3.7452 1.8379 0.3304
dipole: 4.1850
quadrupole: -94.2538 -80.5052 -73.0331
quadrupole: -14.9593 2.5937 0.1386
quadrupole: -11.6564 2.0921 9.5642 -14.9593 2.5937 0.1386
hfenergy: -699.5822841 hartree
pointgroup: C01 [X(C6H11N3O4)]
dipole: -1.4607433 -0.2512715 -0.716966 debye
dipolederiv: -0.8624554 0.0356402 0.002213 -0.1835635 -0.5188543 -0.2650498 -0.3208502 -0.242579 -0.7329678 -0.7674428 0.0053074 -0.0254781 0.2514501 -0.548928 -0.252259 0.2877673 -0.2733305 -0.7600134 -0.4168163 0.0421364 0.0623281 0.0992333 -0.6927173 -0.3704846 0.143819 -0.3764941 -0.9539289 -1.0994919 0.1838075 0.1858705 0.0551742 -0.4224592 -0.1454008 -0.0007728 -0.1323764 -0.5074075 -1.3112097 0.1636462 0.1636363 0.2611056 -0.467206 -0.0139867 0.2909142 -0.0333964 -0.4494683 -1.3800726 -0.076684 -0.2027526 -0.135414 -0.437288 -0.0150587 -0.2922516 -0.008683 -0.479787 -0.9614305 -0.0838381 -0.0714456 -0.0797261 -0.2222085 -0.0505852 -0.1582006 -0.0438474 -0.3892981 0.1703226 0.1069984 0.1372346 0.271422 0.2209146 -0.1615405 0.3679428 -0.1744425 0.1195095 1.6787927 0.0255515 0.1870575 0.2019875 0.4531307 0.4282823 0.4456546 0.4094947 0.8137449 0.2903677 -0.123014 -0.1783636 -0.2781634 0.2246194 -0.1284087 -0.402381 -0.1137487 0.0907105 1.3723659 -0.2117165 -0.1141011 -0.4385952 0.4368727 0.4116842 -0.3846399 0.4262951 0.7743732 0.4473906 0.0258268 -0.1003414 0.0175497 0.1976031 -0.0466472 -0.2658112 -0.0774026 0.1611142 1.4637023 -0.1548545 -0.097103 -0.0846312 0.6476237 0.6092504 0.0063876 0.6027185 1.0837217 -0.0176024 0.0182792 -0.0105953 -0.0032889 0.0602458 0.0577529 -0.1137831 0.0577254 -0.0596856 -0.0307563 -0.0237253 0.0058647 -0.1075533 -0.0749412 -0.0063928 -0.0495514 0.0045728 0.0812749 0.3820185 -0.0119192 -0.0097395 -0.1172589 0.2718392 -0.0657291 -0.1543406 -0.0505326 0.2215524 0.2988857 0.0281719 0.0363793 0.0745436 0.2818524 -0.063355 0.1040599 -0.0676786 0.2430096 0.0029578 -0.0032802 -0.0089989 0.0874124 -0.025484 0.0105471 0.0563095 0.0093465 0.1147312 -0.0013365 -0.0020993 -0.0014269 0.026577 0.088965 0.0548815 0.1064926 0.0443068 0.0053199 -0.0102261 -0.0245414 0.0058214 -0.0441551 0.0052704 0.1251912 0.0145229 0.0918674 -0.0500793 0.0008641 0.0589931 0.0345546 0.0464479 -0.0927763 -0.1064545 0.0190831 -0.0687349 0.062068 0.2817019 0.1017862 0.0053311 0.0793519 0.1351585 0.084647 0.1270572 0.147457 0.0739064 0.3717754 -0.0688094 0.043152 -0.0138447 0.0826383 -0.0623988 0.1847571 -0.0994856 0.1667896 0.0976954 -0.0116631 -0.0490969 0.0139392 0.396129 -0.0284852 -0.0121853 -0.0310518 0.3708101 unknown
polarizability: 139.7478599|-3.118257|71.9095918|0.9179471|17.5679107|85.4553646 unknown
InChI: InChI=1S/C6H11N3O4/c7-1-4(10)8-2-5(11)9-3-6(12)13/h8-9,12H,1-3,7H2
charge 0 multiplicity 1
24 atoms
O  -0.398781 1.09101 1.320131
O  3.255953 -0.922933 -1.285046
O  -3.999595 -0.587694 -1.466834
O  -5.427026 0.529999 -0.005439
N  1.864377 0.161334 0.218532
N  -1.788154 0.103466 -0.252753
N  5.603543 0.180279 -0.03187
C  0.642987 -0.225228 -0.47871
C  -0.550971 0.380672 0.27546
C  -3.002276 0.624653 0.37814
C  3.106505 -0.227099 -0.230767
C  4.307053 0.204636 0.653844
C  -4.27212 0.212413 -0.34436
H  0.661973 0.131812 -1.527993
H  0.551393 -1.328988 -0.528482
H  1.72604 0.742895 1.054444
H  -1.900299 -0.469812 -1.092451
H  -2.978805 1.730596 0.429162
H  -3.078949 0.285404 1.429515
H  4.347369 -0.485643 1.519934
H  4.12892 1.215107 1.068012
H  5.692988 0.925444 -0.732672
H  5.777342 -0.730748 -0.474656
H  -4.847066 -0.843076 -1.919941
