program: Gaussian 09
title: 000139679
version: EM64L-G09RevD.01
frameworkgroup: C1[X(C9H9N2O)]
method: RPBEPBE
basis: SDD
operation: Freq
keyword: #p
keyword: freq=noraman
keyword: PBEPBE/SDD
title: #p freq=noraman PBEPBE/SDD
converged: YES YES NO NO
title: Mulliken charges:
elementType: O N N C C C C C C C C C H H H H H H H H H
charge: -0.356860 -0.039335 0.109565 0.306999 0.124082 -0.308913 -0.283214 0.204022 -0.218885 -0.208033 -0.187314 -0.730519 0.260909 0.281884 0.267224 0.270584 0.271947 0.276041 0.274409 0.282493 0.402914
chargesum: 1.00000
title: Mulliken charges with hydrogens summed into heavy atoms:
elementType: O N N C C C C C C C C C
charge: 0.046054 -0.039335 0.109565 0.306999 0.124082 -0.048004 -0.001331 0.204022 0.048339 0.062551 0.084634 0.102424
polarizability: 2.36057676e+02 -6.15107014e+00 1.07074829e+02 -5.46920078e+00 -6.63008495e+00 5.33653825e+01
1716.lowfreq: -8.2773 -7.2111 0.0008 0.0009 0.0010 3.3043 54.9923 65.5039 118.7548
frequency: 54.9913 65.4988 118.7524 162.3844 187.3319 223.5219 264.2963 279.3635 344.5976 391.3292 395.7349 449.8951 480.7057 503.9724 537.6408 607.7638 623.9767 661.2190 684.8680 690.8329 791.8998 847.7696 880.7085 957.4209 985.2911 994.0352 998.4609 1022.3751 1025.2722 1042.1136 1093.6251 1132.5418 1159.7759 1190.1659 1205.1070 1216.5551 1325.3537 1375.7041 1398.5436 1408.7986 1435.8012 1456.7129 1460.6831 1474.4521 1511.2553 1561.7416 1603.7322 2028.2166 3002.8350 3093.9072 3124.2199 3156.2454 3165.2538 3173.7244 3183.4638 3190.5770 3527.6990
redmass: 5.3539 4.0876 5.2547 4.2850 1.7340 1.9186 4.2755 3.6758 5.9310 3.4963 2.7702 5.2937 1.3792 6.3370 4.4777 6.4605 5.7885 5.0628 3.0420 2.4483 1.9444 1.2586 3.6549 1.3632 5.8539 1.5862 1.5254 1.4270 1.9314 1.3499 1.7827 2.1622 2.2608 1.0625 1.2113 3.7913 1.3994 3.4695 5.2271 1.2604 2.4209 1.8877 1.0996 1.3128 3.1382 5.0016 5.8028 13.7695 1.0366 1.1008 1.1000 1.0878 1.0892 1.0932 1.0968 1.1014 1.0669
irintensity: 0.8766 0.7089 0.7041 9.2053 0.7118 2.5906 2.6793 2.8546 0.2783 25.3497 1.9511 2.8989 116.2052 7.1478 8.8542 0.4538 15.9036 3.3833 39.6246 40.7787 58.3071 9.2387 12.1100 2.9572 16.0272 47.8994 18.6288 0.2997 9.5930 6.1498 61.9249 150.7228 102.5998 1.1743 5.9262 17.4259 2.8480 25.8502 21.5571 61.6596 96.0269 88.1326 35.7682 28.5841 417.9337 2.4653 222.0604 442.3724 0.9766 1.8920 1.3961 0.0989 0.4998 1.6096 2.3327 4.4021 71.7102
temp: 298.150 k
press: 1.00000 atm
elementType: 8 7 7 6 6 6 6 6 6 6 6 6 1 1 1 1 1 1 1 1 1
symmnumber: 1
zpe: 424259.9 jmol-1
zpe.correction: 0.161592 hartree
zpe.thermalcorrener: 0.172626 hartree
zpe.thermalcorrenthalpy: 0.173570 hartree
zpe.thermalcorrgfe: 0.124548 hartree
zpe.sumelectzpe: -531.922827 hartree
zpe.sumelectthermal: -531.911794 hartree
zpe.sumelectthermalent: -531.910849 hartree
zpe.sumelectthermalfe: -531.959872 hartree
dipole: 2.1894 0.8137 0.8901
dipole: 2.4996
quadrupole: -29.8727 -51.5831 -68.5639
quadrupole: -1.2805 1.5252 -2.7131
quadrupole: 20.1339 -1.5765 -18.5573 -1.2805 1.5252 -2.7131
hfenergy: -532.0844193 hartree
pointgroup: C01 [X(C9H9N2O1)]
dipole: 0.8481388 0.4975172 0.0152793 debye
dipolederiv: -0.3707479 0.305765 -0.1406545 0.2005801 -0.8427269 0.3842199 -0.1557283 0.319864 -0.5442077 2.2572199 -0.1325778 -0.1287561 -0.7396901 -0.044662 0.1386401 0.1586978 0.1336387 0.0779202 -1.2072578 0.0795404 0.0699246 0.4051172 0.0295792 -0.0207934 -0.0480409 -0.0049125 0.0417095 -1.4144608 0.1114673 -0.0629292 0.1269321 -0.0381262 0.0029723 -0.1010325 0.0260472 -0.0521463 2.3379275 -0.0260819 0.0133521 0.2673756 0.777915 -0.4590543 -0.0694607 -0.4042015 0.5093009 0.472992 0.0295349 -0.1195421 -0.4219732 -0.0715357 -0.0151467 0.3825211 -0.0582716 -0.0103015 0.535606 -0.1301581 0.1735598 0.2980666 -0.0434806 -0.0638219 -0.2990298 -0.0161205 0.0126368 -1.5878295 -0.187754 0.1763583 -0.0346449 0.073609 0.0027179 0.2112711 -0.0586301 -0.09436 -0.5596959 -0.1066743 0.2002122 -0.1745115 -0.0665641 -0.0824858 0.362276 -0.0763413 0.0253472 -0.3207654 0.1616131 -0.2706647 0.2652319 -0.1122 -0.0177159 -0.4071027 -0.0218845 -0.0567651 0.3753896 -0.0288632 0.0101371 -0.0069419 0.0073498 -0.0887704 -0.0140109 -0.0980513 0.1095809 -0.0422918 0.0034258 0.0455192 -0.0410243 0.0463216 0.0115493 -0.0246899 -0.0196765 0.1025066 0.0514084 -0.0264363 0.0827243 -0.0074683 0.112488 0.0507331 0.0626167 0.0582712 0.0460868 0.0902964 0.0254451 -0.0437137 -0.0114714 0.1271646 0.0564617 -0.0382052 0.0398848 0.0735572 0.0714176 0.0174462 -0.0252434 0.0473674 0.1253089 0.0713516 -0.0324096 0.0744793 0.0320801 0.0415673 -0.0227593 0.0482036 -0.0407686 0.1342694 0.0574023 0.0492623 0.063178 0.0551015 -0.0071993 0.0131566 -0.009814 0.0035685 0.1429306 0.0213043 -0.0169412 0.0202258 0.1207495 0.1322798 0.0371938 -0.0440751 0.0169591 0.0507017 -0.027983 -0.016879 0.0133625 -0.0333519 0.0060932 -0.0845329 -0.047423 -0.0238053 0.0760908 0.0083095 -0.0476128 -0.0155722 0.1147724 0.0307161 0.0546945 0.0534165 0.0265922 0.1064387 0.0132723 0.0458548 0.0352255 0.064274 0.1073346 -0.0934449 0.0194083 -0.1554912 0.4091281 -0.0431628 -0.0013563 -0.0105152 0.4055089 unknown
polarizability: 236.2145073|-4.5595447|76.5770754|-5.5050481|-27.2877596|83.7063048 unknown
InChI: InChI=1S/C9H9N2O/c1-7(11-10)9(12)8-5-3-2-4-6-8/h2-6,12H,1H3
charge 1 multiplicity 1
21 atoms
O  1.068816 -1.455655 1.126937
N  3.035325 0.0360 -0.135612
N  4.15783 -0.301184 -0.170417
C  -0.681601 -0.151359 0.228968
C  0.7500 -0.346865 0.383482
C  -1.239051 0.532485 -0.899776
C  -1.557426 -0.717115 1.212729
C  1.762113 0.505561 -0.164052
C  -2.631932 0.656503 -1.025469
C  -2.947692 -0.573727 1.082194
C  -3.488972 0.11503 -0.032912
C  1.604371 1.916899 -0.715507
H  -0.596401 0.910248 -1.699197
H  -1.133079 -1.248216 2.069047
H  -3.056939 1.160266 -1.898494
H  -3.61256 -0.994434 1.842014
H  -4.573858 0.222652 -0.133625
H  1.540642 1.92846 -1.817365
H  2.46077 2.545553 -0.417407
H  0.69446 2.374299 -0.297809
H  2.013687 -1.546503 1.41997
