program: Gaussian 09
title: 000139677
version: EM64L-G09RevD.01
frameworkgroup: C1[X(C10H18)]
method: RPBEPBE
basis: SDD
operation: Freq
keyword: #p
keyword: freq=noraman
keyword: PBEPBE/SDD
title: #p freq=noraman PBEPBE/SDD
converged: YES YES NO NO
title: Mulliken charges:
elementType: C C C C C C C C C C H H H H H H H H H H H H H H H H H H
charge: -0.041074 0.321754 -0.479007 -0.433745 -0.229223 -0.742438 -0.734810 -0.755714 -0.436139 -0.229547 0.190960 0.200753 0.218089 0.202190 0.202079 0.205837 0.215514 0.209879 0.210606 0.210326 0.231828 0.202965 0.208946 0.207526 0.225842 0.209221 0.209525 0.197855
chargesum: 0.00000
title: Mulliken charges with hydrogens summed into heavy atoms:
elementType: C C C C C C C C C C
charge: 0.149886 0.321754 -0.060164 -0.029475 -0.023386 -0.106440 -0.089691 -0.113400 -0.017392 -0.031691
polarizability: 1.27548500e+02 -1.29977520e+00 9.86380983e+01 4.99329603e+00 -5.87217703e-01 8.61092558e+01
1716.lowfreq: -15.7999 -2.2301 -0.0004 0.0005 0.0008 12.0915 71.3215 77.8899 182.0397
frequency: 71.2244 77.8649 182.0203 220.7702 230.7642 246.5296 261.5422 279.3465 316.0032 329.3138 344.2362 401.3980 436.1508 452.0643 478.7947 558.7053 636.3254 721.2512 757.1886 810.6753 861.9161 886.2806 920.4481 925.7037 929.2792 935.9668 939.8843 978.5199 996.1890 1015.4868 1017.3209 1058.5723 1083.5314 1095.6906 1131.0421 1172.5932 1197.8257 1222.1586 1226.4185 1246.1986 1249.9396 1294.5348 1304.2232 1334.0153 1337.4313 1341.0926 1374.9819 1375.4453 1388.1434 1402.7111 1455.2878 1458.9377 1464.3222 1467.1721 1470.1922 1473.8452 1482.4741 1488.8620 1497.2874 1667.9728 2902.7529 2949.9994 2966.5278 2968.6133 2973.4552 2974.2020 2978.6650 3005.0320 3035.5981 3044.9572 3057.0169 3061.0242 3066.2728 3067.1312 3072.1949 3075.5638 3086.3140 3118.8732
redmass: 2.4569 2.5375 1.4493 1.6685 1.7187 1.1300 1.3708 1.6748 2.6312 2.2692 2.3315 2.3434 2.5945 2.3208 2.6964 2.7449 2.0253 1.5933 2.2221 2.3654 2.6869 1.6586 1.9008 1.6821 1.9011 1.8384 1.3810 1.2450 1.7358 1.8291 1.4277 1.7800 1.5597 2.0643 1.1650 1.4487 1.7494 1.6198 2.0159 1.7497 1.3817 1.6844 1.3370 1.4548 1.6570 1.4454 1.2166 1.2140 1.4747 1.2136 1.0856 1.0588 1.0565 1.0590 1.0788 1.0782 1.0527 1.0602 1.0570 7.0254 1.0810 1.0639 1.0355 1.0352 1.0387 1.0634 1.0593 1.0926 1.0994 1.1027 1.0996 1.0994 1.0982 1.0994 1.0982 1.0978 1.0839 1.0972
irintensity: 0.0178 0.1238 0.0973 0.0375 0.3427 0.0262 0.0920 0.0550 0.0687 0.0088 0.2972 0.0744 0.4131 2.3157 0.0620 5.5126 18.0912 13.3620 7.7649 2.9894 9.4457 7.6276 1.0112 2.2619 6.5324 1.7692 0.6995 0.3078 5.7281 1.6644 1.1221 2.2512 3.6786 0.5440 4.8847 3.1484 3.4261 6.4586 20.7669 7.7330 0.6503 1.4053 5.8657 1.4324 0.7733 1.2145 21.5674 25.7106 6.0607 15.1369 6.5543 2.2919 2.6158 1.8594 7.8540 6.4705 9.1915 7.2266 24.5318 3.3622 31.8946 43.1902 30.9462 43.7149 15.8872 25.9093 39.0225 54.5224 55.2280 53.1082 3.0708 31.5961 79.0803 13.1722 70.1284 58.3081 4.6202 58.2631
temp: 298.150 k
press: 1.00000 atm
elementType: 6 6 6 6 6 6 6 6 6 6 1 1 1 1 1 1 1 1 1 1 1 1 1 1 1 1 1 1
symmnumber: 1
zpe: 666237.8 jmol-1
zpe.correction: 0.253757 hartree
zpe.thermalcorrener: 0.264873 hartree
zpe.thermalcorrenthalpy: 0.265818 hartree
zpe.thermalcorrgfe: 0.218124 hartree
zpe.sumelectzpe: -391.032756 hartree
zpe.sumelectthermal: -391.021639 hartree
zpe.sumelectthermalent: -391.020695 hartree
zpe.sumelectthermalfe: -391.068389 hartree
dipole: 0.0389 0.3378 -0.0105
dipole: 0.3402
quadrupole: -62.5762 -63.8631 -65.3110
quadrupole: 0.4309 0.7928 -0.1397
quadrupole: 1.3406 0.0536 -1.3942 0.4309 0.7928 -0.1397
hfenergy: -391.2865125 hartree
pointgroup: C01 [X(C10H18)]
dipole: 0.0114134 0.1324629 -0.0153899 debye
polarizability: 127.6405242|-0.0495153|98.4244809|4.8572001|-1.4835523|86.2308491 unknown
InChI: InChI=1S/C10H18/c1-10(2,3)9-7-5-4-6-8-9/h5,7,9H,4,6,8H2,1-3H3
charge 0 multiplicity 1
28 atoms
C  -0.130653 0.058039 -0.473535
C  -1.619321 -0.006624 0.062075
C  0.661616 1.301607 0.015285
C  2.152945 1.216544 -0.385968
C  0.656294 -1.214825 -0.176671
C  -2.390796 -1.132703 -0.68329
C  -1.663168 -0.287304 1.587738
C  -2.341702 1.337003 -0.231136
C  2.837331 -0.001746 0.276176
C  1.970923 -1.244013 0.169227
H  -0.226171 0.142976 -1.5824
H  0.593122 1.377455 1.119166
H  0.216055 2.223371 -0.401843
H  2.679742 2.149768 -0.107914
H  2.226348 1.119544 -1.488129
H  0.118856 -2.169102 -0.264164
H  -1.97155 -2.134106 -0.478669
H  -3.449984 -1.148018 -0.364065
H  -2.368317 -0.971235 -1.77828
H  -1.172376 0.517397 2.165356
H  -1.157013 -1.237912 1.836256
H  -2.711643 -0.356777 1.934976
H  -2.273691 1.602738 -1.303906
H  -3.413953 1.260078 0.031244
H  -1.915077 2.169998 0.35539
H  3.047309 0.213766 1.346094
H  3.824402 -0.191325 -0.191666
H  2.450173 -2.211593 0.378051
