program: Gaussian 09
title: 000139672
version: EM64L-G09RevD.01
frameworkgroup: C1[X(BrF3Si)]
method: RPBEPBE
basis: SDD
operation: Freq
keyword: #pfreq=noraman
keyword: PBEPBE/SDD
title: #p freq=noraman PBEPBE/SDD
converged: NO YES NO NO
title: Mulliken charges:
elementType: Br Si F F F
charge: -0.137896 1.380642 -0.414218 -0.414226 -0.414303
chargesum: 0.00000
title: Mulliken charges with hydrogens summed into heavy atoms:
polarizability: 5.04973735e+01 -3.12949302e-04 2.31073173e+01 -3.77127935e-03 3.30310768e-05 2.30988233e+01
1716.lowfreq: -0.0020 -0.0017 -0.0017 6.2409 7.3194 13.8864 158.2126 158.5481 231.0521
frequency: 158.2126 158.5474 231.0521 262.6470 262.9086 417.1017 732.6396 858.4427 860.2312
redmass: 20.9450 20.9355 27.3209 20.5810 20.5798 24.9156 21.5325 22.5946 22.6064
irintensity: 1.4140 1.3581 13.9976 28.4200 28.5834 115.9300 174.9860 139.4949 139.7038
temp: 298.150 k
press: 1.00000 atm
elementType: 35 14 9 9 9
symmnumber: 1
zpe: 23577.1 jmol-1
zpe.correction: 0.008980 hartree
zpe.thermalcorrener: 0.015041 hartree
zpe.thermalcorrenthalpy: 0.015985 hartree
zpe.thermalcorrgfe: -0.022614 hartree
zpe.sumelectzpe: -602.120745 hartree
zpe.sumelectthermal: -602.114684 hartree
zpe.sumelectthermalent: -602.113740 hartree
zpe.sumelectthermalfe: -602.152339 hartree
dipole: -1.3229 -0.0003 -0.0036
dipole: 1.3229
quadrupole: -44.7650 -46.0968 -46.0889
quadrupole: -0.0001 -0.0078 0.0000
quadrupole: 0.8852 -0.4466 -0.4387 -0.0001 -0.0078 0.0000
hfenergy: -602.1297252 hartree
pointgroup: C01[X(Br1F3Si1)]
dipole: 0.5204751 0.0015716 0.0002802 debye
dipolederiv: -0.6148754 -0.0000764 -0.0001311 0.0000062 -0.2061779 0.0000009 -0.0001151 0.0000008 -0.2061536 2.5763817 0.0001537 0.0002109 0.0002851 1.8578362 -0.0000092 0.0002382 -0.0000086 1.85783 -0.6539808 0.0543593 0.0967215 0.0697161 -0.5030493 -0.0776944 0.1245371 -0.0781364 -0.5978933 -0.6538436 0.0566002 -0.0954224 0.0726217 -0.5068213 0.0799106 -0.1228936 0.0803534 -0.5942571 -0.6536819 -0.1110367 -0.001379 -0.1426289 -0.6417877 -0.0022078 -0.0017666 -0.0022092 -0.4595261 unknown
polarizability: 50.4973715|0.0034968|23.0988238|0.007623|-0.0000718|23.1073189 unknown
InChI: InChI=1S/BrF3Si/c1-5(2,3)4
charge 0 multiplicity 1
5 atoms
Br 2.178975 0.000291 0.000651
Si -0.089074 0.000345 0.000004
F  -0.696838 0.76573 1.364541
F  -0.695952 0.798054 -1.346328
F  -0.697111 -1.564319 -0.018868
