program: Gaussian 09
title: 000139669
version: EM64L-G09RevD.01
frameworkgroup: C1[X(C6H12S2)]
method: RPBEPBE
basis: SDD
operation: Freq
keyword: #pfreq=noraman
keyword: PBEPBE/SDD
title: #p freq=noraman PBEPBE/SDD
converged: YES YES NO NO
title: Mulliken charges:
elementType: S S C C C C C C H H H H H H H H H H H H
charge: 0.169608 0.169676 -0.597266 -0.597302 -0.655340 -0.655341 -0.363536 -0.363443 0.259397 0.259100 0.259375 0.259123 0.231772 0.231732 0.222010 0.231759 0.231738 0.222011 0.242479 0.242448
chargesum: 0.00000
title: Mulliken charges with hydrogens summed into heavy atoms:
elementType: S S C C C C C C
charge: 0.169608 0.169676 -0.078769 -0.078804 0.030174 0.030167 -0.121057 -0.120995
polarizability: 1.85564623e+02 -6.86047856e+00 8.36731416e+01 -1.28164355e-02 7.58413648e-04 5.80685087e+01
1716.lowfreq: -105.2086 -36.3089 -7.8788 -0.0017 0.0013 0.0018 7.1372 19.2128 36.2596
frequency: -105.1327 -36.3087 36.2596 49.7473 65.7550 137.8414 185.0122 230.6019 243.6411 243.6829 274.6842 363.0500 371.9058 626.9198 631.1334 694.6730 734.9072 791.5150 791.6599 803.3045 892.3726 998.8927 1000.0419 1033.6198 1033.6855 1070.4246 1072.2233 1197.0192 1242.8332 1243.4354 1262.9363 1285.6961 1291.5575 1397.6319 1397.6795 1458.9404 1459.5436 1470.7128 1470.7575 1484.2606 1484.2700 1584.2963 2987.5051 2987.6431 3015.8588 3016.0957 3076.8708 3076.9001 3082.4848 3082.5430 3103.7087 3103.8570 3131.3214 3131.4735
redmass: 1.8269 2.8185 2.3786 2.5887 3.8624 4.4772 7.3634 4.4983 1.0859 1.0821 3.9474 4.2698 5.6174 4.6101 4.4029 2.0053 9.9988 1.1063 1.1071 4.3383 1.0763 1.8003 1.8408 1.2009 1.2008 2.2576 2.2567 1.1143 1.2348 1.2334 1.2075 1.2524 1.2389 1.2046 1.2047 1.0886 1.0884 1.0390 1.0390 1.0474 1.0473 6.9779 1.0354 1.0354 1.0567 1.0568 1.1043 1.1043 1.0988 1.0988 1.1058 1.1058 1.0947 1.0898
irintensity: 0.0026 4.4383 0.0782 0.0001 1.0072 0.0000 0.1704 0.0001 0.0001 0.0462 0.4596 10.6858 0.0001 0.0008 4.7697 0.0030 94.9159 22.4133 0.0106 0.0018 84.4707 43.0617 0.0007 0.0994 0.0048 6.8809 0.0003 14.1636 0.0012 1.9416 0.0017 59.7955 0.0012 3.0596 40.3683 18.4756 0.0026 0.4644 29.9593 16.3810 0.0040 0.0002 66.5852 0.3893 46.6046 0.2374 0.0121 0.0532 37.8448 20.9827 0.6048 97.6469 7.1632 15.5218
temp: 298.150 k
press: 1.00000 atm
elementType: 16 16 6 6 6 6 6 6 1 1 1 1 1 1 1 1 1 1 1 1
symmnumber: 1
zpe: 430089.7 jmol-1
zpe.correction: 0.163813 hartree
zpe.thermalcorrener: 0.174165 hartree
zpe.thermalcorrenthalpy: 0.175109 hartree
zpe.thermalcorrgfe: 0.126238 hartree
zpe.sumelectzpe: -1031.267436 hartree
zpe.sumelectthermal: -1031.257084 hartree
zpe.sumelectthermalent: -1031.256140 hartree
zpe.sumelectthermalfe: -1031.305011 hartree
dipole: -0.0004 -0.0002 0.0216
dipole: 0.0216
quadrupole: -49.5631 -64.2165 -68.4336
quadrupole: -8.9450 -0.0018 0.0012
quadrupole: 11.1746 -3.4788 -7.6958 -8.9450 -0.0018 0.0012
hfenergy: -1031.431249 hartree
pointgroup: C01 [X(C6H12S2)]
dipole: -0.000164 -0.0000702 0.0085138 debye
dipolederiv: -0.7771011 0.0292048 0.0005482 -0.2697669 -0.0340092 0.0008631 -0.0015451 0.0010424 -0.1001888 -0.7771205 0.029258 -0.0003629 -0.2696437 -0.033945 -0.0008082 0.0016915 -0.0009671 -0.1001411 0.4620521 -0.2085742 -0.0021282 -0.412645 0.1217247 0.0002937 -0.00251 -0.0002567 0.1800234 0.4617907 -0.2086582 0.0019825 -0.4127579 0.1218229 -0.0001968 0.0022828 0.0002472 0.1800237 -0.1579852 -0.0450323 -0.0001882 0.1646103 0.0311318 -0.0004617 0.0014928 -0.0002314 0.059245 -0.157932 -0.0449926 0.0000854 0.1646496 0.0311445 0.000416 -0.0014806 0.0001542 0.0592659 0.4248789 0.1147453 0.0006079 0.444204 0.0422584 -0.0007898 0.0021199 -0.0001635 -0.2448463 0.4250462 0.1146668 -0.0008764 0.4440553 0.0421656 0.0006854 -0.0023388 0.000113 -0.244842 -0.0204916 0.0131464 -0.0328899 0.0802353 -0.0547463 -0.1069132 -0.0143378 -0.1063352 -0.0484612 -0.0203345 0.0122961 0.0335219 0.0793878 -0.0579498 0.1065055 0.0159498 0.1061398 -0.0452769 -0.0204538 0.0130324 0.0329801 0.0801293 -0.0549115 0.1069016 0.0144379 0.1063131 -0.0482668 -0.0203065 0.0124184 -0.0334764 0.0795286 -0.0578355 -0.1065269 -0.0158844 -0.1061648 -0.0454883 0.1141644 -0.0066668 -0.0026723 -0.0778945 0.0249975 -0.1124923 -0.0478288 -0.1095661 -0.0626015 0.1141547 -0.0064437 0.0022134 -0.0784517 0.0215451 0.1139336 0.046257 0.1109144 -0.059227 -0.1358023 0.1095276 0.001137 0.1260427 -0.0193431 -0.0012119 0.0012137 -0.0011814 0.1228582 0.1140964 -0.0067386 0.0027638 -0.0780203 0.0248585 0.1125204 0.0479032 0.1096165 -0.0624314 0.1141762 -0.0064034 -0.0021777 -0.0783656 0.0217142 -0.1139075 -0.0462567 -0.110844 -0.0594078 -0.1357016 0.1095311 -0.001138 0.1260853 -0.0194187 0.0011767 -0.0012425 0.0011496 0.1228525 -0.0035653 -0.0121387 0.0000785 -0.0556862 -0.0755998 -0.0000454 -0.0017464 0.0001736 0.1984684 -0.0035652 -0.0121784 -0.0000087 -0.0556964 -0.0756044 0.0000578 0.0018226 -0.0001537 0.198442 unknown
polarizability: 185.8760055|-3.9040994|83.3617592|-0.012833|0.0003875|58.0685087 unknown
InChI: InChI=1S/C6H12S2/c1-3-7-5-6-8-4-2/h5-6H,3-4H2,1-2H3
charge 0 multiplicity 1
20 atoms
S  -2.126181 -0.793895 -0.012378
S  2.127799 0.800233 -0.013066
C  -3.446217 0.573643 -0.000477
C  3.447397 -0.567605 -0.001517
C  -4.837449 -0.073784 -0.004312
C  4.838845 0.079416 -0.00411
C  -0.628946 0.255165 -0.010756
C  0.630334 -0.248454 -0.010968
H  -3.28905 1.1841 0.905015
H  -3.290656 1.198079 -0.89668
H  3.289657 -1.178789 0.903388
H  3.292214 -1.191319 -0.898294
H  -4.986618 -0.696872 -0.903887
H  -4.985023 -0.710771 0.885734
H  -5.617617 0.709351 0.002455
H  4.988677 0.703078 -0.903174
H  4.986082 0.715751 0.886461
H  5.618748 -0.703972 0.002581
H  -0.826283 1.33403 -0.010721
H  0.827387 -1.327385 -0.010994
