program: Gaussian 09
title: 000139665
version: EM64L-G09RevD.01
frameworkgroup: C1[X(C10H10O2S)]
method: RPBEPBE
basis: SDD
operation: Freq
keyword: #p
keyword: freq=noraman
keyword: PBEPBE/SDD
title: #p freq=noraman PBEPBE/SDD
converged: NO YES NO NO
title: Mulliken charges:
elementType: S O O C C C C C C C C C C H H H H H H H H H H
charge: 0.884924 -0.521129 -0.521245 -0.062745 0.448315 -0.240261 -0.240206 -0.366770 -0.366280 -0.799410 -0.264630 0.231293 -0.738085 0.287821 0.287654 0.244189 0.244173 0.231379 0.231343 0.241647 0.263109 0.264461 0.260451
chargesum: 0.00000
title: Mulliken charges with hydrogens summed into heavy atoms:
elementType: S O O C C C C C C C C C C
charge: 0.884924 -0.521129 -0.521245 -0.062745 0.448315 0.047560 0.047448 -0.122581 -0.122107 -0.095041 -0.264630 0.231293 0.049937
polarizability: 1.83575619e+02 1.83385953e+00 1.12157792e+02 -7.79715046e-02 -8.74203427e-02 1.21452719e+02
1716.lowfreq: -22.6136 -9.4253 -3.2010 -0.0022 -0.0012 0.0000 1.6045 15.5980 36.2326
frequency: -22.5918 15.4489 36.2288 37.4639 76.9684 99.9887 132.0170 188.7239 226.6194 253.8420 279.3739 307.0629 317.4668 346.8585 359.3578 406.6311 411.9435 430.0635 474.5010 522.5926 586.4556 621.1546 708.1610 769.9048 793.9826 829.0573 848.7029 929.5093 962.3670 981.5950 989.0406 994.2489 1017.4964 1028.2696 1030.1315 1049.4056 1053.5157 1117.9741 1183.2625 1216.6912 1295.0808 1382.0539 1389.6701 1398.5572 1400.0315 1453.7132 1454.1246 1471.1287 1472.5518 1474.2067 1594.4001 1598.2857 2228.5774 2980.5698 2985.5733 3063.1454 3078.4002 3079.9172 3092.7195 3135.2662 3136.6815 3159.6934 3162.7989
redmass: 1.0207 1.0120 4.1004 3.7756 6.4024 4.6735 7.1114 5.1243 7.9508 5.6495 7.3819 3.8717 4.8406 5.2394 3.5684 2.9726 6.7606 8.3907 5.7380 3.9993 6.3549 6.9585 3.2976 6.0323 9.4006 1.3644 1.2433 16.6116 1.3104 1.3791 1.4081 5.5086 5.4577 1.4090 1.4095 1.5946 2.4536 1.2821 1.1435 3.0268 1.2621 7.1015 2.8158 1.2196 1.2153 1.0403 1.0401 1.1024 2.3733 1.0581 6.0157 7.0501 11.7738 1.0390 1.0350 1.0947 1.0985 1.0985 1.1001 1.0889 1.0892 1.0955 1.0970
irintensity: 0.4549 0.0256 2.5817 1.1501 0.3782 0.8532 2.2066 3.0445 9.6188 3.2488 3.4592 3.5516 2.4421 5.2836 2.3362 0.5646 6.7376 34.6737 107.0518 151.2035 57.0842 0.0816 1.4526 34.5718 76.4446 36.0797 0.7793 82.7667 1.1390 0.0359 2.3126 2.9997 50.1879 7.5267 6.2450 20.0545 22.9650 7.7699 9.0156 5.8294 2.5818 0.6720 10.2365 15.5521 3.4877 16.2029 16.7043 17.4244 23.5429 13.7353 8.2822 0.1309 145.8815 24.1695 11.8270 19.7223 6.0685 5.2667 14.6502 15.0372 5.8821 0.6236 11.6772
temp: 298.150 k
press: 1.00000 atm
elementType: 16 8 8 6 6 6 6 6 6 6 6 6 6 1 1 1 1 1 1 1 1 1 1
symmnumber: 1
zpe: 443343.4 jmol-1
zpe.correction: 0.168861 hartree
zpe.thermalcorrener: 0.182634 hartree
zpe.thermalcorrenthalpy: 0.183578 hartree
zpe.thermalcorrgfe: 0.125707 hartree
zpe.sumelectzpe: -934.377989 hartree
zpe.sumelectthermal: -934.364215 hartree
zpe.sumelectthermalent: -934.363271 hartree
zpe.sumelectthermalfe: -934.421142 hartree
dipole: -2.7806 6.7200 0.0111
dipole: 7.2725
quadrupole: -63.4035 -88.1129 -83.9820
quadrupole: 13.9112 0.0127 -0.0338
quadrupole: 15.0960 -9.6134 -5.4825 13.9112 0.0127 -0.0338
hfenergy: -934.5468493 hartree
pointgroup: C01 [X(C10H10O2S1)]
dipole: -1.0265574 2.670687 -0.0169176 debye
dipolederiv: 2.3974618 0.2962901 -0.0018432 0.4209971 1.9714368 -0.0051412 -0.0056289 -0.0019218 1.2288025 -0.7383094 0.0119586 0.0350344 -0.0069298 -0.6042188 -0.0220821 0.053326 -0.1508942 -0.5829234 -0.7368777 0.0103763 -0.0358687 -0.0068129 -0.6027361 0.0203835 -0.0522713 0.149976 -0.5854786 -0.0531653 -0.0167234 0.0005719 0.0018789 -0.276805 0.0020454 -0.0004072 0.0008143 -0.1332129 0.4328123 -0.1791559 0.0009588 -0.2561961 0.0811321 -0.0003816 0.0014069 -0.0002385 0.0122378 -0.1694912 -0.0091741 0.0917 0.0262837 -0.078682 -0.0613241 -0.2205119 0.0519417 -0.021255 -0.169671 -0.0099186 -0.0913628 0.0275748 -0.0783574 0.062118 0.2201054 -0.0516219 -0.0213184 -0.1967371 0.0090365 -0.1201102 0.0165811 -0.1471775 0.0463888 -0.1044474 0.0382913 0.0631191 -0.1970497 0.0101506 0.1197734 0.0175694 -0.1480764 -0.0452099 0.1040102 -0.036766 0.06367 -0.121791 0.0782146 -0.000496 0.2098994 -0.0218269 0.0005174 -0.0019188 0.0007008 0.0776327 -0.985964 -0.408453 0.0043083 -0.5558206 -0.9695256 0.0043148 0.0066752 0.0012102 -0.3893397 0.2361089 0.2112426 -0.0044734 0.2265675 0.2154436 -0.0003544 -0.0073987 0.0037505 0.0172886 -0.0346288 -0.1048657 0.0024162 -0.0985965 -0.0326868 -0.0001718 0.0186152 -0.0015978 0.0669544 0.1291866 0.0236184 -0.0607123 0.0084091 0.1412223 0.0321241 -0.0443468 0.0021583 0.0655981 0.128603 0.0242433 0.0606898 0.0089463 0.1408374 -0.0326758 0.0445399 -0.0026965 0.0655924 -0.0034089 0.0458254 0.0868375 0.0525869 0.1371334 -0.0267535 0.0816864 -0.0257625 -0.0353214 -0.0032268 0.0451122 -0.0870867 0.051966 0.1374184 0.0255304 -0.0820657 0.0245259 -0.035802 -0.0026999 0.0026933 -0.045548 -0.0535334 0.0922799 -0.0651634 -0.1272418 -0.0597803 -0.0562578 -0.0021583 0.0033713 0.0454033 -0.0519287 0.0937814 0.0634625 0.1281661 0.0577594 -0.05813 0.015142 0.004284 0.000115 0.0549751 -0.1250985 0.0014845 -0.0000963 0.0016416 0.1168202 0.0808498 -0.0641763 -0.018156 -0.0746253 0.0582234 -0.0343845 -0.0453015 -0.0593475 -0.044112 -0.0544314 -0.0136417 0.0700551 -0.0039727 0.0525692 -0.0344866 0.0750751 -0.0251513 0.1002906 0.0494462 0.0296912 -0.0522065 -0.0158193 -0.036287 0.0697597 -0.04197 0.0830084 0.0851447 unknown
polarizability: 183.6225289|0.0195962|112.1099658|-0.1239884|-0.0084587|121.4536361 unknown
InChI: InChI=1S/C10H10O2S/c1-3-8-13(11,12)10-6-4-9(2)5-7-10/h4-7H,1-2H3
charge 0 multiplicity 1
23 atoms
S  1.384067 -1.188206 0.007554
O  1.611368 -1.961596 -1.411891
O  1.612681 -1.942862 1.436905
C  -0.372402 -0.473974 0.00398
C  -2.992249 0.499608 -0.000519
C  -0.995385 -0.252036 1.240491
C  -0.994527 -0.261091 -1.234604
C  -2.318741 0.242256 1.223626
C  -2.317833 0.233402 -1.222317
C  -4.403878 1.057343 -0.003141
C  2.42273 0.286349 -0.002251
C  3.222176 1.226762 -0.009519
C  4.162538 2.351291 -0.015798
H  -0.474273 -0.48264 2.17551
H  -0.473009 -0.49869 -2.167641
H  -2.836024 0.422767 2.172887
H  -2.834436 0.406962 -2.17325
H  -4.967695 0.731422 -0.894258
H  -4.966509 0.742951 0.892833
H  -4.388993 2.164468 -0.010331
H  4.392144 2.677626 1.014432
H  5.110758 2.062458 -0.503594
H  3.744092 3.213632 -0.565504
