program: Gaussian 09
title: 000139648
version: EM64L-G09RevD.01
frameworkgroup: C1[X(C7H12O5)]
method: RPBEPBE
basis: SDD
operation: Freq
keyword: #pfreq=noraman
keyword: PBEPBE/SDD
title: #p freq=noraman PBEPBE/SDD
converged: YES YES NO NO
title: Mulliken charges:
elementType: O O O O O C C C C C C C H H H H H H H H H H H H
charge: -0.256370 -0.247194 -0.431156 -0.227935 -0.239318 -0.262655 0.291127 0.220291 -0.228478 -0.229732 -0.670945 -0.669109 0.276442 0.229376 0.236762 0.235904 0.238379 0.213595 0.234649 0.231301 0.216605 0.233375 0.233514 0.371573
chargesum: 0.00000
title: Mulliken charges with hydrogens summed into heavy atoms:
elementType: O O O O O C C C C C C C
charge: -0.256370 -0.247194 -0.059583 -0.227935 -0.239318 0.013787 0.291127 0.220291 0.237661 0.244550 0.008599 0.014385
polarizability: 1.06931736e+02 5.43807380e+00 9.93448950e+01 -3.68444978e+00 -3.41486081e+00 7.55182336e+01
1716.lowfreq: -10.1277 -8.9266 0.0008 0.0012 0.0013 5.3018 9.9573 21.7729 42.3495
frequency: 6.2002 20.9887 42.2143 59.1080 81.6618 127.6688 133.9697 145.8384 196.5843 239.6039 252.2515 264.6148 273.3093 305.9904 344.4227 368.6737 393.1605 435.2868 566.2504 677.8905 726.4841 769.5675 798.4538 798.7796 806.4714 831.5040 882.3319 942.4037 1011.0217 1020.4740 1028.3579 1109.8110 1114.4147 1117.4904 1134.8478 1134.8946 1184.9825 1235.6037 1250.6108 1251.2360 1296.8783 1354.9869 1357.2392 1382.0554 1401.4262 1402.1669 1463.0892 1464.1982 1472.2531 1472.9419 1484.9994 1485.3312 1625.7481 1643.9225 2997.4576 2999.2325 3013.3065 3017.1425 3073.3348 3078.0944 3090.1771 3094.0720 3096.1782 3110.4128 3112.9295 3484.8195
redmass: 3.7506 2.7412 2.8245 3.8493 4.6532 3.2979 2.9561 3.6535 2.4392 1.5101 1.6357 2.0604 3.9131 4.3641 3.7168 2.0804 2.6303 4.8776 8.9598 5.9724 8.1200 5.8327 1.1041 1.1196 3.7763 4.5585 6.6960 4.6916 2.7432 2.4043 3.4806 3.0018 2.2680 2.4689 1.4653 1.4639 3.5653 1.5762 1.1404 1.1386 1.4657 1.3901 1.3286 1.2794 1.2619 1.2698 1.0399 1.0396 1.0654 1.0655 1.0665 1.0648 9.5745 10.1872 1.0359 1.0359 1.0582 1.0581 1.1067 1.1069 1.0857 1.0985 1.0985 1.1029 1.1033 1.0651
irintensity: 0.6407 0.3194 0.8879 0.4332 2.8177 3.5194 0.7326 1.7714 5.6724 8.9582 17.1350 24.7936 12.8600 57.5527 3.4592 53.2428 42.4096 10.9421 18.2672 11.5324 9.2473 8.0275 4.5822 4.3115 10.6566 6.0619 2.2555 16.7013 22.8588 95.2963 177.9648 183.5190 5.1516 141.3404 6.8477 7.0140 225.5398 168.7410 2.2506 2.0688 94.1374 1.5456 0.7446 26.2424 13.0480 38.7171 12.8716 12.0992 4.1290 4.7023 14.3297 15.7162 79.6983 280.1887 18.9391 16.1966 15.6161 15.0116 6.2161 4.4052 6.9372 27.7870 25.4577 40.8226 40.0081 36.7765
temp: 298.150 k
press: 1.00000 atm
elementType: 8 8 8 8 8 6 6 6 6 6 6 6 1 1 1 1 1 1 1 1 1 1 1 1
symmnumber: 1
zpe: 493817.4 jmol-1
zpe.correction: 0.188085 hartree
zpe.thermalcorrener: 0.202639 hartree
zpe.thermalcorrenthalpy: 0.203583 hartree
zpe.thermalcorrgfe: 0.142634 hartree
zpe.sumelectzpe: -649.094971 hartree
zpe.sumelectthermal: -649.080417 hartree
zpe.sumelectthermalent: -649.079473 hartree
zpe.sumelectthermalfe: -649.140422 hartree
dipole: -0.2072 4.5439 -0.4254
dipole: 4.5684
quadrupole: -56.7923 -72.8838 -75.4509
quadrupole: -1.8449 0.8547 1.1830
quadrupole: 11.5833 -4.5081 -7.0753 -1.8449 0.8547 1.1830
hfenergy: -649.2830558 hartree
pointgroup: C01 [X(C7H12O5)]
dipole: -0.2774892 -1.7748717 -0.0578209 debye
dipolederiv: -1.0394778 0.6298852 -0.102098 0.7244894 -0.8947335 0.2127259 -0.0465112 0.171945 -0.4907157 -0.8939654 -0.5010029 -0.1611491 -0.6354407 -1.2190955 -0.1150619 -0.2266911 -0.1254355 -0.3150213 -0.5271817 -0.0764339 0.1397833 0.0204348 -0.7193119 -0.1496898 0.1732555 -0.0970305 -0.3233716 -0.5426481 0.0865624 0.1508342 0.2157573 -0.5125719 0.1205513 -0.0050486 0.3178478 -0.8001974 -0.6679639 0.2618302 -0.100321 -0.0693685 -0.9287055 -0.0186712 -0.1799869 0.2033236 -0.3137583 -0.1965332 0.0699756 -0.0560985 0.1172356 0.5121298 0.0954753 -0.1087283 0.0698972 0.2074449 1.0618004 -0.5385095 -0.0815793 -0.8791292 0.8744817 -0.3430769 0.007297 -0.6076566 0.948786 1.0837754 -0.068427 0.2053078 0.4967188 1.5615996 0.0199172 0.4082658 -0.2344485 0.2302384 0.7036121 -0.2658078 0.0174041 -0.2394363 0.5235235 0.0363961 -0.1291522 0.139547 0.255447 0.693421 0.3405122 0.0796373 0.2555655 0.4539111 0.0868391 0.1372456 0.1613915 0.3710829 -0.0333124 0.0880199 -0.0397774 0.0911682 -0.0399814 0.0507424 -0.0192867 0.042718 0.0203224 -0.0012207 -0.0652047 -0.0088043 -0.0627743 -0.118179 -0.0134441 -0.0238803 -0.0193152 0.0528937 0.0980275 -0.0011916 -0.0022222 -0.0254707 0.0051078 0.0403072 0.016422 0.0616983 0.0096195 -0.050454 0.010255 -0.099276 0.0278729 0.0088157 -0.0496641 -0.0136103 -0.0919988 -0.0605836 -0.0526469 0.0020161 0.0324671 -0.0596712 -0.0808629 0.0585404 0.0756738 0.0012643 0.0524216 -0.0828162 -0.0154553 0.0240367 0.062882 -0.0154336 -0.064957 0.0459911 -0.0904624 0.0111979 -0.0031862 -0.0816873 0.0145243 -0.0246967 0.0114754 0.0758519 -0.0406553 0.0307875 -0.0878676 -0.0496883 0.1077393 0.0801465 0.1081397 0.0403723 -0.0328786 0.0970654 -0.0486106 0.0256237 0.080178 -0.0379822 -0.0679029 -0.0523565 0.0419519 -0.0926992 -0.1083405 -0.0448128 -0.055302 0.0099033 -0.1329695 0.0479609 -0.0913771 -0.0185083 0.0553243 0.0074826 0.0729633 0.069904 -0.0942576 -0.0709564 -0.0941159 -0.0592898 0.0525767 -0.0171201 -0.0992734 -0.0278119 0.074149 -0.004738 0.1108434 0.0995548 0.0549517 0.0302581 -0.0406063 0.0978349 -0.0407883 0.0419297 0.1252638 0.0260218 -0.0052671 -0.006949 0.0534255 0.0440993 0.0157449 0.0907546 -0.1089391 0.3841089 0.1219672 -0.0730454 0.0307441 0.3777545 0.0410988 -0.0811138 0.0642329 0.1846958 unknown
polarizability: 105.1875962|-6.4225383|101.1860127|4.4534058|-1.1952161|75.4212555 unknown
InChI: InChI=1S/C7H12O5/c1-3-11-6(9)5(8)7(10)12-4-2/h5,8H,3-4H2,1-2H3
charge 0 multiplicity 1
24 atoms
O  1.806377 -0.644949 0.507775
O  -1.774285 -0.607231 0.23266
O  0.241784 2.30907 1.128569
O  1.235808 0.75006 -1.276699
O  -2.093962 1.674778 -0.153723
C  -0.00079 0.904301 0.871124
C  1.057486 0.345648 -0.107006
C  -1.404446 0.71762 0.267954
C  2.899226 -1.255539 -0.319636
C  -3.106267 -0.913143 -0.396257
C  3.605183 -2.273601 0.567839
C  -3.283418 -2.42483 -0.333224
H  0.076658 0.362871 1.826315
H  2.435387 -1.713847 -1.211768
H  3.567141 -0.442001 -0.6548
H  -3.881132 -0.366458 0.170099
H  -3.087656 -0.524855 -1.430091
H  4.42094 -2.759044 0.001742
H  4.041427 -1.786592 1.456344
H  2.904856 -3.055695 0.907156
H  -4.2521 -2.702859 -0.78673
H  -2.480584 -2.940326 -0.886849
H  -3.273661 -2.781084 0.710676
H  -0.29747 2.833808 0.474929
