program: Gaussian 09
title: 000139636
version: EM64L-G09RevD.01
frameworkgroup: CS[SG(HP),X(F2)]
method: RPBEPBE
basis: SDD
operation: Freq
keyword: #p
keyword: freq=noraman
keyword: PBEPBE/SDD
title: #p freq=noraman PBEPBE/SDD
converged: YES YES YES YES
title: Mulliken charges:
elementType: P F F H
charge: 0.872236 -0.435091 -0.435091 -0.002054
chargesum: 0.00000
title: Mulliken charges with hydrogens summed into heavy atoms:
elementType: P F F
charge: 0.870182 -0.435091 -0.435091
polarizability: 2.13147297e+01 -2.93640181e+00 1.93060708e+01 -1.93271063e-08 4.08409423e-09 2.46756210e+01
1716.lowfreq: -25.2297 -25.1600 -15.1416 -0.0037 -0.0034 -0.0014 259.6515 690.9206 694.5443
frequency: 259.6514 690.9194 694.5443 835.5685 873.5260 2085.7249
redmass: 16.4755 19.8191 19.9550 1.0672 1.1428 1.0418
irintensity: 9.5899 96.9368 57.6149 5.8160 29.4333 144.7788
temp: 298.150 k
press: 1.00000 atm
elementType: 15 9 9 1
symmnumber: 1
zpe: 32538.0 jmol-1
zpe.correction: 0.012393 hartree
zpe.thermalcorrener: 0.016059 hartree
zpe.thermalcorrenthalpy: 0.017003 hartree
zpe.thermalcorrgfe: -0.013749 hartree
zpe.sumelectzpe: -541.266810 hartree
zpe.sumelectthermal: -541.263145 hartree
zpe.sumelectthermalent: -541.262201 hartree
zpe.sumelectthermalfe: -541.292952 hartree
dipole: -0.7744 2.5982 0.0000
dipole: 2.7111
quadrupole: -22.4597 -23.1193 -27.2788
quadrupole: -1.0455 0.0000 0.0000
quadrupole: 1.8263 1.1666 -2.9929 -1.0455 0.0000 0.0000
hfenergy: -541.2792035 hartree
pointgroup: CS [SG(H1P1),X(F2)]
dipole: 0. -1.0344924 -0.2598572 debye
dipolederiv: 1.2925312 0. 0. 0. 1.1143359 0.0026916 0. -0.1723532 1.0011466 -0.6253009 -0.1534992 -0.0763919 -0.3258072 -0.5304591 -0.0301644 0.0985619 0.1123515 -0.3171291 -0.6253009 0.1534992 0.0763919 0.3258072 -0.5304591 -0.0301644 -0.0985619 0.1123515 -0.3171291 -0.0419294 0. 0. 0. -0.0534177 0.0576372 0. -0.0523498 -0.3668884 unknown
polarizability: 24.675621|0.|19.5653483|0.|3.0126452|21.0554522 unknown
InChI: InChI=1S/F2HP/c1-3-2/h3H
charge 0 multiplicity 1
4 atoms
P  0.0000 -0.756713 0.0423
F  1.319532 0.376526 -0.00709
F  -1.319532 0.376526 -0.00709
H  0.0000 -1.001639 -1.412121
