program: Gaussian 09
title: 000139615
version: EM64L-G09RevD.01
frameworkgroup: C1[X(F4P2)]
method: RPBEPBE
basis: SDD
operation: Freq
keyword: #p
keyword: freq=noraman
keyword: PBEPBE/SDD
title: #p freq=noraman PBEPBE/SDD
converged: YES YES NO YES
title: Mulliken charges:
elementType: P P F F F F
charge: 0.838729 0.838728 -0.419365 -0.419363 -0.419363 -0.419366
chargesum: 0.00000
title: Mulliken charges with hydrogens summed into heavy atoms:
polarizability: 7.36367420e+01 1.99661954e-05 4.58012247e+01 1.13158315e+01 -8.25093666e-06 3.83490186e+01
1716.lowfreq: -10.7216 -0.0010 0.0024 0.0033 13.5114 23.9447 30.1846 67.3044 118.0133
frequency: 30.1846 67.3044 118.0133 143.1563 186.8988 267.4937 270.9920 408.9673 678.2556 695.3930 696.2407 699.4907
redmass: 20.0628 19.0205 24.1205 20.6374 21.2332 20.3017 21.3489 27.9596 22.5303 22.3365 22.3533 22.5845
irintensity: 5.2666 0.1351 18.2338 0.0000 0.0000 16.5415 0.0000 0.0000 0.0001 168.2858 0.0003 170.9169
temp: 298.150 k
press: 1.00000 atm
elementType: 15 15 9 9 9 9
symmnumber: 1
zpe: 25494.8 jmol-1
zpe.correction: 0.009710 hartree
zpe.thermalcorrener: 0.017841 hartree
zpe.thermalcorrenthalpy: 0.018785 hartree
zpe.thermalcorrgfe: -0.025294 hartree
zpe.sumelectzpe: -1081.391374 hartree
zpe.sumelectthermal: -1081.383243 hartree
zpe.sumelectthermalent: -1081.382299 hartree
zpe.sumelectthermalfe: -1081.426378 hartree
dipole: 0.0000 -0.0037 0.0000
dipole: 0.0037
quadrupole: -51.9819 -52.1462 -44.2744
quadrupole: 0.0000 5.3216 0.0000
quadrupole: -2.5144 -2.6787 5.1931 0.0000 5.3216 0.0000
hfenergy: -1081.401084 hartree
pointgroup: C01 [X(F4P2)]
dipole: -0.0000039 0.0000073 -0.0014411 debye
dipolederiv: 0.8770302 0.1185987 -0.0002708 0.6281054 0.639018 0.0000461 -0.0001157 -0.0001078 1.160596 0.8770186 0.118602 0.0001964 0.6281069 0.639015 0.0001806 -0.0000846 0.0002561 1.1605942 -0.4389095 -0.0593462 0.1871523 -0.3143649 -0.3195949 0.272343 0.3261545 -0.0031381 -0.579996 -0.4381198 -0.0592534 -0.1868649 -0.3137413 -0.3194206 -0.2724704 -0.3260564 0.003217 -0.5805994 -0.4381946 -0.059207 0.1868994 -0.3137018 -0.3193548 0.2723582 0.3261545 -0.0032897 -0.5805872 -0.4388249 -0.0593943 -0.1871123 -0.3144043 -0.3196628 -0.2724574 -0.3260523 0.0030625 -0.5800076 unknown
polarizability: 70.6248393|-15.0086527|41.3609209|0.0037207|-0.0005811|45.8012251 unknown
InChI: InChI=1S/2F2P/c2*1-3-2
charge 0 multiplicity 1
6 atoms
P  1.031319 -0.744588 -0.000379
P  -1.031358 0.744593 -0.000721
F  1.782054 0.126561 -1.307413
F  1.780059 0.125896 1.308254
F  -1.780293 -0.125572 1.308014
F  -1.781881 -0.12689 -1.307655
